[Top][All Lists]

[Date Prev][Date Next][Thread Prev][Thread Next][Date Index][Thread Index]

(An other) Mandrake 7.1 instalation problem

From: chenu-tournier marc
Subject: (An other) Mandrake 7.1 instalation problem
Date: Wed, 6 Sep 2000 09:11:41 -0400 (EDT)


I have been using octave on my computer with Mandrake 7.1 for long and it
works fine.
I have installed Mandrake on a new PC and I wanted to compile it again.

I've got texinfo, flex, bison, stdc++,...

Here is the message i get after make

c++ -c  -I. -I.. -I../liboctave -I../src -I../libcruft/misc  -I../glob
-I../glob -DHAVE_CONFIG_H -mieee-fp -fno-rtti -fno-exc
eptions -fno-implicit-templates -g
-O2 -Wall In function `void symbols_of_variables()': Internal compiler error in `count_pseudo', at
Please submit a full bug report.
See <URL:> for
make[2]: *** [variables.o] Error 1
make[2]: Leaving directory `/tmp/octave-2.0.16/src'
make[1]: *** [src] Error 2
make[1]: Leaving directory `/tmp/octave-2.0.16'
make: *** [all] Error 2

I've recompiled octave on my machine and it works fine.
Is there a missing package?

I made an package update on the new PC and not on mine, (glibc changed)
could that be it?

Thanks for help

FREE Personalized Email at
Sign up at

Octave is freely available under the terms of the GNU GPL.

Octave's home on the web:
How to fund new projects:
Subscription information:

reply via email to

[Prev in Thread] Current Thread [Next in Thread]