Archives are refreshed every 15 minutes - for details, please visit
the main index
.
You can also
download the archives in mbox format
.
bug-guix (thread)
[
Date Index
][
Top
][
All Lists
]
Advanced
[
Prev Period
]
Last Modified: Wed Jun 30 2021 20:44:07 -0400
Threads in reverse chronological order
[
Next Period
]
bug#49307: clisp: build failure: failing tests
,
Christopher Howard
,
2021/06/30
bug#49304: `make check-system` fails to run on master
,
Domagoj Stolfa
,
2021/06/30
Message not available
bug#49304: Acknowledgement (`make check-system` fails to run on master)
,
Domagoj Stolfa
,
2021/06/30
bug#48591: ugrep: illegal instruction
,
raingloom
,
2021/06/30
bug#49302: Some tests/syscalls.scm skipped when running under -j20
,
Domagoj Stolfa
,
2021/06/30
bug#49299: kicad build failure: undefined reference
,
Christopher Howard
,
2021/06/30
bug#49299: kicad build failure: undefined reference
,
bdju
,
2021/06/30
bug#49295: mumi: mu-debug is unbound in mu-message-send
,
Maxime Devos
,
2021/06/30
bug#49276: evolution-data-server: test-failure
,
Christopher Howard
,
2021/06/29
bug#49276: evolution-data-server: test-failure
,
Mark H Weaver
,
2021/06/29
bug#49263: Guix weather backtrace
,
Jack Hill
,
2021/06/28
bug#49263: Guix weather backtrace
,
Maxime Devos
,
2021/06/28
bug#49263: Guix weather backtrace
,
Jack Hill
,
2021/06/28
bug#49263: Guix weather backtrace
,
Maxime Devos
,
2021/06/29
bug#49263: Guix weather backtrace
,
Mathieu Othacehe
,
2021/06/29
bug#49262: Crash in hurd-vm service when invoking 'herd restart networking'
,
Maxim Cournoyer
,
2021/06/28
bug#47542: rust-stackvector package is vulnerable to CVE-2021-29939
,
zimoun
,
2021/06/28
bug#22304: Build for Julia is not reproducible
,
Ludovic Courtès
,
2021/06/27
bug#49240: Guix 1.3.0 tests/guix-environment.sh fails with Guile 2.2.7
,
藍挺瑋
,
2021/06/27
bug#49233: gmnisrv: missing mime.types
,
Christopher Howard
,
2021/06/26
bug#20255: 'search-paths' should respect both user and system profile.
,
Maxim Cournoyer
,
2021/06/25
bug#20255: 'search-paths' should respect both user and system profile.
,
Leo Prikler
,
2021/06/26
bug#20255: 'search-paths' should respect both user and system profile.
,
Maxim Cournoyer
,
2021/06/28
bug#20255: 'search-paths' should respect both user and system profile.
,
Leo Prikler
,
2021/06/28
bug#20255: 'search-paths' should respect both user and system profile.
,
Alex Kost
,
2021/06/27
bug#20255: 'search-paths' should respect both user and system profile.
,
Maxim Cournoyer
,
2021/06/28
bug#20255: 'search-paths' should respect both user and system profile.
,
Alex Kost
,
2021/06/29
bug#18838: zsh test suite failures, possibly due to 'noatime' mount flag
,
Maxim Cournoyer
,
2021/06/25
bug#44995: User options are not passed to the offload machine
,
Maxim Cournoyer
,
2021/06/25
bug#49230: please update description for package nyacc
,
Matt Wette
,
2021/06/25
bug#49230: please update description for package nyacc
,
Tobias Geerinckx-Rice
,
2021/06/26
bug#49230: please update description for package nyacc
,
Matt Wette
,
2021/06/26
bug#49230: please update description for package nyacc
,
Tobias Geerinckx-Rice
,
2021/06/26
bug#49228: guix import go fails when module does not have a documenation on pkg.go.dev
,
Björn Höfling
,
2021/06/25
bug#49228: guix import go fails when module does not have a documenation on pkg.go.dev
,
Sarah Morgensen
,
2021/06/25
bug#49228: guix import go fails when module does not have a documenation on pkg.go.dev
,
Björn Höfling
,
2021/06/28
bug#49228: guix import go fails when module does not have a documenation on pkg.go.dev
,
zimoun
,
2021/06/28
bug#49228: guix import go fails when module does not have a documenation on pkg.go.dev
,
raingloom
,
2021/06/30
bug#48520: rav1e 0.3.5 is not reproducible
,
Maxim Cournoyer
,
2021/06/25
bug#49226: tidy build failure: invoke error
,
Christopher Howard
,
2021/06/25
bug#49226: tidy build failure: invoke error
,
Leo Prikler
,
2021/06/25
bug#49225: Possibly difficult to reproduce GnuTLS build bug?
,
Domagoj Stolfa
,
2021/06/25
bug#49223: guix download nix failure
,
Domagoj Stolfa
,
2021/06/25
bug#49223: guix download nix failure
,
Ludovic Courtès
,
2021/06/25
bug#49220: luajit doesn't support powerpc64le
,
Chris Marusich
,
2021/06/25
bug#49220: LuaJIT on powerpc64le-linux-gnu (POWER9)?
,
Chris Marusich
,
2021/06/25
bug#49220: LuaJIT on powerpc64le-linux-gnu (POWER9)?
,
Efraim Flashner
,
2021/06/28
bug#49218: texlive-latex-base fails to build: "missing engine: luajithbtex"
,
Chris Marusich
,
2021/06/25
bug#49216: error with guix download and redirections
,
ATuin
,
2021/06/25
bug#49206: source hash mismatch on hypre
,
Efraim Flashner
,
2021/06/24
bug#49205: [services]: nginx doesn't restart after guix system reconfigure
,
Raghav Gururajan
,
2021/06/24
bug#49205: [services]: nginx doesn't restart after guix system reconfigure
,
Tobias Geerinckx-Rice
,
2021/06/24
bug#42068: CUPS :631/admin interface freezes
,
Tobias Geerinckx-Rice
,
2021/06/23
bug#49202: guix import go type error (failed regex match?)
,
raingloom
,
2021/06/23
bug#49202: guix import go type error (failed regex match?)
,
zimoun
,
2021/06/24
bug#49202: guix import go type error (failed regex match?)
,
Sarah Morgensen
,
2021/06/24
bug#49202: guix import go type error (failed regex match?)
,
Sarah Morgensen
,
2021/06/24
bug#49202: guix import go type error (failed regex match?)
,
zimoun
,
2021/06/25
bug#49202: guix import go type error (failed regex match?)
,
zimoun
,
2021/06/28
bug#49202: guix import go type error (failed regex match?)
,
raingloom
,
2021/06/30
bug#48715: guix pull does not complete
,
zimoun
,
2021/06/23
Message not available
bug#48715: guix pull does not complete
,
zimoun
,
2021/06/28
bug#49171: [bug#49183] [PATCH] gnu: ocaml-dose3: Fix tests.
,
pukkamustard
,
2021/06/23
bug#49171: [bug#49183] [PATCH] gnu: ocaml-dose3: Fix tests.
,
Julien Lepiller
,
2021/06/23
bug#49173: ungoogled-chromium fails to build
,
qqq0ppp
,
2021/06/22
bug#49173: Log file
,
qqq0ppp
,
2021/06/22
bug#49173: Log file, maybe now...
,
qqq0ppp
,
2021/06/22
bug#49173: Log file, maybe now...
,
Ludovic Courtès
,
2021/06/23
bug#49173: Log file, maybe now...
,
qqq0ppp
,
2021/06/23
bug#49173: Log file, maybe now...
,
qqq0ppp
,
2021/06/27
bug#49174: Poor 'guix substitute' performance when receiving Zstd-compressed substitutes
,
Maxim Cournoyer
,
2021/06/22
bug#49174: Poor 'guix substitute' performance when receiving Zstd-compressed substitutes
,
Ludovic Courtès
,
2021/06/23
bug#49171: OCaml packages not building (due to updated python-pyyaml)
,
pukkamustard
,
2021/06/22
bug#49168: ‘guix import pypi’ misses package dependencies
,
Ludovic Courtès
,
2021/06/22
bug#49168: ‘guix import pypi’ misses package dependencies
,
Leo Prikler
,
2021/06/22
bug#49168: ‘guix import pypi’ misses package dependencies
,
Ludovic Courtès
,
2021/06/22
bug#49168: ‘guix import pypi’ misses package dependencies
,
Leo Prikler
,
2021/06/22
bug#49168: ‘guix import pypi’ misses package dependencies
,
Maxim Cournoyer
,
2021/06/22
bug#49168: ‘guix import pypi’ misses package dependencies
,
Ludovic Courtès
,
2021/06/23
bug#49168: ‘guix import pypi’ misses package dependencies
,
Leo Prikler
,
2021/06/23
bug#49168: ‘guix import pypi’ misses package dependencies
,
Ludovic Courtès
,
2021/06/24
bug#49168: ‘guix import pypi’ misses package dependencies
,
Maxim Cournoyer
,
2021/06/24
bug#49168: ‘guix import pypi’ misses package dependencies
,
Ludovic Courtès
,
2021/06/25
bug#49168: ‘guix import pypi’ misses package dependencies
,
Leo Prikler
,
2021/06/25
bug#49168: ‘guix import pypi’ misses package dependencies
,
Maxim Cournoyer
,
2021/06/25
bug#49168: ‘guix import pypi’ misses package dependencies
,
Ludovic Courtès
,
2021/06/28
bug#49164: PPPOE connection issues
,
Soheil Khanalipur
,
2021/06/21
bug#49161: kicad-5.1.6 fails to build
,
bdju
,
2021/06/21
bug#49161: kicad-5.1.6 fails to build
,
Brice Waegeneire
,
2021/06/22
bug#49161: kicad-5.1.6 fails to build
,
Vinicius Monego
,
2021/06/22
bug#49161: kicad-5.1.6 fails to build
,
Vinicius Monego
,
2021/06/22
bug#49161: kicad-5.1.6 fails to build
,
Vinicius Monego
,
2021/06/22
bug#49161: kicad-5.1.6 fails to build
,
Guillaume Le Vaillant
,
2021/06/22
bug#49161: kicad-5.1.6 fails to build
,
Vinicius Monego
,
2021/06/22
bug#49161: kicad-5.1.6 fails to build
,
Vinicius Monego
,
2021/06/22
bug#49161: kicad-5.1.6 fails to build
,
Guillaume Le Vaillant
,
2021/06/22
bug#49145: Cannot build Guix (Texinfo failure)
,
HiPhish
,
2021/06/21
bug#49145: Cannot build Guix (Texinfo failure)
,
Julien Lepiller
,
2021/06/22
bug#49145: Cannot build Guix (Texinfo failure)
,
HiPhish
,
2021/06/22
bug#49145: Cannot build Guix (Texinfo failure)
,
HiPhish
,
2021/06/25
bug#49145: Cannot build Guix (Texinfo failure)
,
Julien Lepiller
,
2021/06/26
bug#49145: Cannot build Guix (Texinfo failure)
,
HiPhish
,
2021/06/28
bug#47867: [1.2.1 pre-release testing] substitute downloading and TLS errors
,
Ludovic Courtès
,
2021/06/21
bug#49157: castor-0.8.16 fails to build
,
bdju
,
2021/06/21
bug#49157: castor-0.8.16 fails to build
,
Efraim Flashner
,
2021/06/21
bug#47018: core-updates: make check fails when guix-daemon is running
,
Ludovic Courtès
,
2021/06/20
bug#49126: Guix installation 1.3 : crash when deleting free space during manual partitioning
,
Christophe Pisteur
,
2021/06/20
bug#49126: Guix installation 1.3 : crash when deleting free space during manual partitioning
,
Mathieu Othacehe
,
2021/06/29
bug#49122: gobject-introspection and not finding cairo
,
John Kehayias
,
2021/06/20
bug#49122: (No Subject)
,
John Kehayias
,
2021/06/20
bug#49122: (No Subject)
,
John Kehayias
,
2021/06/20
bug#49125: python-gitdb upgrade hangs after executing "guix pull && guix refresh"
,
Emad Alblueshi
,
2021/06/20
bug#49121: ./guix-daemon is broken
,
Tobias Geerinckx-Rice
,
2021/06/19
bug#49121: ./guix-daemon is broken
,
Mark H Weaver
,
2021/06/20
bug#49121: ./guix-daemon is broken
,
Tobias Geerinckx-Rice
,
2021/06/20
bug#49115: Mumi inserts spurious underscore in bug title
,
Tobias Geerinckx-Rice
,
2021/06/19
bug#49115: Mumi inserts spurious underscore in bug title
,
Tobias Geerinckx-Rice
,
2021/06/19
bug#49114: ‘guix lint’ should catch certificate validation exceptions
,
Tobias Geerinckx-Rice
,
2021/06/19
bug#49114: ‘guix lint’ should catch certificate validation exceptions
,
Ludovic Courtès
,
2021/06/23
bug#49114: ‘guix lint’ should catch certificate validation exceptions
,
Tobias Geerinckx-Rice
,
2021/06/23
bug#49114: ‘guix lint’ should catch certificate validation exceptions
,
Ludovic Courtès
,
2021/06/24
bug#49106: slow load for cups /admin page
,
Christopher Howard
,
2021/06/18
bug#49106: slow load for cups /admin page
,
Maxime Devos
,
2021/06/19
bug#49106: slow load for cups /admin page
,
Brice Waegeneire
,
2021/06/19
bug#49106: slow load for cups /admin page
,
Maxime Devos
,
2021/06/19
bug#49102: guix environment regression
,
Mathieu Othacehe
,
2021/06/18
bug#49102: guix environment regression
,
Mathieu Othacehe
,
2021/06/19
bug#49102: guix environment regression
,
Ludovic Courtès
,
2021/06/22
bug#49100: make check fails: %derivation-cache
,
Chris Marusich
,
2021/06/18
bug#49100: make check fails: %derivation-cache
,
Ludovic Courtès
,
2021/06/20
bug#49100: make check fails: %derivation-cache
,
Chris Marusich
,
2021/06/22
bug#49089: --fallback doesn't do anything when 'connect*' fails
,
Maxime Devos
,
2021/06/18
bug#49089: --fallback doesn't do anything when 'connect*' fails
,
Mathieu Othacehe
,
2021/06/18
bug#48468: substitute server connection timeout
,
Ludovic Courtès
,
2021/06/18
bug#48468: substitute server connection timeout
,
Mathieu Othacehe
,
2021/06/29
bug#49088: grub-hybrid fails to build on aarch64-linux: error: --enable-stack-protector is not supported
,
Christopher Baines
,
2021/06/18
bug#38050: during substitution: In procedure =: Wrong type argument in position 1: #f
,
Maxime Devos
,
2021/06/18
bug#49083: ‘guix import pypi’ fails in the absence of “sdist” releases
,
Ludovic Courtès
,
2021/06/18
bug#49083: ‘guix import pypi’ fails in the absence of “sdist” releases
,
Leo Prikler
,
2021/06/18
bug#49083: ‘guix import pypi’ fails in the absence of “sdist” releases
,
Ludovic Courtès
,
2021/06/20
bug#49083: ‘guix import pypi’ fails in the absence of “sdist” releases
,
Maxim Cournoyer
,
2021/06/22
bug#49071: error: TLS-fout in procedure ‘read_from_session_record_port’: Error decoding the received TLS packet.
,
Maxime Devos
,
2021/06/17
bug#49071: error: TLS-fout in procedure ‘read_from_session_record_port’: Error decoding the received TLS packet.
,
Ludovic Courtès
,
2021/06/18
bug#49071: error: TLS-fout in procedure ‘read_from_session_record_port’: Error decoding the received TLS packet.
,
Maxime Devos
,
2021/06/18
bug#49071: error: TLS-fout in procedure ‘read_from_session_record_port’: Error decoding the received TLS packet.
,
Maxime Devos
,
2021/06/18
bug#47672: [PATCH] gnu: owncloud-client: Fix sysconfdir path
,
Daniel Meißner
,
2021/06/16
bug#47672: owncloud-client : "Could not read system exclude file"
,
Daniel Meißner
,
2021/06/16
bug#49063: GNOME Music fails to start
,
Luis Felipe
,
2021/06/16
bug#41257: ibus-setup failed
,
Ricardo Wurmus
,
2021/06/15
bug#36868: [PATCH] etc: completion: remove package list when using completion on guix system build
,
Solene Rapenne
,
2021/06/15
bug#36868: [PATCH] etc: completion: remove package list when using completion on guix system build
,
Ludovic Courtès
,
2021/06/18
bug#36868: [PATCH] etc: completion: remove package list when using completion on guix system build
,
Solene Rapenne
,
2021/06/18
bug#36868: [PATCH] etc: completion: remove package list when using completion on guix system build
,
Ludovic Courtès
,
2021/06/20
bug#49031: guix refresh error
,
Emad Alblueshi
,
2021/06/15
bug#49031: guix refresh error
,
Brice Waegeneire
,
2021/06/16
bug#49031: guix refresh error
,
Ludovic Courtès
,
2021/06/18
bug#49029: ungoogled-chromium failed to disable malware extension The Great Suspender
,
Jorge P. de Morais Neto
,
2021/06/15
bug#49029: ungoogled-chromium failed to disable malware extension The Great Suspender
,
Leo Famulari
,
2021/06/15
bug#49029: ungoogled-chromium failed to disable malware extension The Great Suspender
,
Leo Prikler
,
2021/06/15
bug#49029: ungoogled-chromium failed to disable malware extension The Great Suspender
,
Jorge P. de Morais Neto
,
2021/06/15
bug#49029: ungoogled-chromium failed to disable malware extension The Great Suspender
,
Leo Famulari
,
2021/06/16
bug#49029: ungoogled-chromium failed to disable malware extension The Great Suspender
,
Leo Famulari
,
2021/06/16
bug#49029: ungoogled-chromium failed to disable malware extension The Great Suspender
,
Marius Bakke
,
2021/06/16
bug#49029: ungoogled-chromium failed to disable malware extension The Great Suspender
,
Jorge P . de Morais Neto
,
2021/06/16
bug#49035: Git 2.32.0 fails with ‘gnutls_handshake’ error
,
Ludovic Courtès
,
2021/06/15
bug#49035: Git 2.32.0 fails with ‘gnutls_handshake’ error
,
Ludovic Courtès
,
2021/06/15
bug#49035: TLS downgrade at bitbucket.org
,
Ludovic Courtès
,
2021/06/15
bug#49035: Git 2.32.0 fails with ‘gnutls_handshake’ error
,
Ludovic Courtès
,
2021/06/18
bug#49035: Git 2.32.0 fails with ‘gnutls_handshake’ error
,
Ludovic Courtès
,
2021/06/18
bug#49035: [gnutls-help] TLS downgrade at bitbucket.org
,
Daiki Ueno
,
2021/06/20
bug#49035: [gnutls-help] TLS downgrade at bitbucket.org
,
Ludovic Courtès
,
2021/06/20
bug#46333: Typos
,
Tarn Burton
,
2021/06/14
bug#49026: at-spi2-core build fails on emulated aarch64
,
Jack Hill
,
2021/06/14
bug#44985: ANSI sequences in unattended-upgrades.log?
,
藍挺瑋
,
2021/06/14
bug#44985: ANSI sequences in unattended-upgrades.log?
,
Ludovic Courtès
,
2021/06/18
bug#48756: guix offload: error: corrupt input while restoring archive from #<closed: file 7f68866bf770>
,
Ludovic Courtès
,
2021/06/14
bug#48756: guix offload: error: corrupt input while restoring archive from #<closed: file 7f68866bf770>
,
Madhavan Krishnan
,
2021/06/14
bug#48756: guix offload: error: corrupt input while restoring archive from #<closed: file 7f68866bf770>
,
Ludovic Courtès
,
2021/06/15
bug#49006: MELPA importer uses the wrong source when called from CLI
,
Xinglu Chen
,
2021/06/13
bug#49006: MELPA importer uses the wrong source when called from CLI
,
Xinglu Chen
,
2021/06/13
bug#48595: `guix install mes` fails in 'check'-phase
,
Ludovic Courtès
,
2021/06/13
bug#48595: `guix install mes` fails in 'check'-phase
,
Gabriel Wicki
,
2021/06/15
bug#47780: [installer] Trying to install to DVD leads to crash
,
Mathieu Othacehe
,
2021/06/13
bug#47780: [installer] Trying to install to DVD leads to crash
,
Ludovic Courtès
,
2021/06/14
bug#47780: [installer] Trying to install to DVD leads to crash
,
Mathieu Othacehe
,
2021/06/17
bug#47780: [installer] Trying to install to DVD leads to crash
,
Ludovic Courtès
,
2021/06/20
bug#48419: Unexpected problem during install of Guix System 1.3.0
,
Mathieu Othacehe
,
2021/06/13
bug#48419: Unexpected problem during install of Guix System 1.3.0
,
Matthias Cullmann
,
2021/06/16
bug#48419: Unexpected problem during install of Guix System 1.3.0
,
Mathieu Othacehe
,
2021/06/17
bug#48380: Guix 1.3 installer restarts after Partitioning Scheme
,
Mathieu Othacehe
,
2021/06/13
bug#47567: Installer crash in 'uuid->string' for a FAT16 partition
,
Mathieu Othacehe
,
2021/06/13
bug#31337: Unable to use gnuk usb smartcard token on GuixSD
,
Brice Waegeneire
,
2021/06/13
bug#48974: A possible shepherd bug (it's very minor)
,
Joshua Branson
,
2021/06/12
bug#48974: A possible shepherd bug (it's very minor)
,
Leo Prikler
,
2021/06/12
bug#48974: A possible shepherd bug (it's very minor)
,
jbranso
,
2021/06/12
bug#48974: A possible shepherd bug (it's very minor)
,
Leo Prikler
,
2021/06/12
bug#48974: A possible shepherd bug (it's very minor)
,
Joshua Branson
,
2021/06/25
bug#48974: A possible shepherd bug (it's very minor)
,
Leo Prikler
,
2021/06/25
bug#48974: A possible shepherd bug (it's very minor)
,
Joshua Branson
,
2021/06/25
bug#48974: A possible shepherd bug (it's very minor)
,
Leo Prikler
,
2021/06/25
bug#48974: A possible shepherd bug (it's very minor)
,
jbranso
,
2021/06/12
bug#48974: A possible shepherd bug (it's very minor)
,
Leo Prikler
,
2021/06/13
bug#48973: An early booting warning message
,
Joshua Branson
,
2021/06/12
bug#48973: An early booting warning message
,
Tobias Geerinckx-Rice
,
2021/06/12
bug#48973: An early booting warning message
,
jbranso
,
2021/06/12
bug#48973: An early booting warning message
,
jbranso
,
2021/06/12
bug#48972: Early guile repl is giving me some GC Warnings
,
Joshua Branson
,
2021/06/12
bug#48972: Early guile repl is giving me some GC Warnings
,
Ludovic Courtès
,
2021/06/18
bug#48972: Early guile repl is giving me some GC Warnings
,
jbranso
,
2021/06/18
bug#48967: No newline after substitution of ~a complete line.
,
Brendan Tildesley
,
2021/06/12
bug#48966: svt-hevc sha256 missmatch.
,
Brendan Tildesley
,
2021/06/12
bug#48966: svt-hevc sha256 missmatch.
,
Tobias Geerinckx-Rice
,
2021/06/12
bug#48965: filter-dkimsign tarball not available
,
Brendan Tildesley
,
2021/06/11
bug#48965: filter-dkimsign tarball not available
,
Tobias Geerinckx-Rice
,
2021/06/12
bug#48965: filter-dkimsign tarball not available
,
Tobias Geerinckx-Rice
,
2021/06/12
bug#48965: filter-dkimsign tarball not available
,
Brendan Tildesley
,
2021/06/12
bug#48965: filter-dkimsign tarball not available
,
Tobias Geerinckx-Rice
,
2021/06/12
bug#48965: filter-dkimsign tarball not available
,
Brendan Tildesley
,
2021/06/12
bug#48965: filter-dkimsign tarball not available
,
Brendan Tildesley
,
2021/06/12
bug#48965: filter-dkimsign tarball not available
,
Tobias Geerinckx-Rice
,
2021/06/12
bug#48963: "guix build guix" halts after exhausting memory
,
Julien Lepiller
,
2021/06/11
bug#48963: "guix build guix" halts after exhausting memory
,
Julien Lepiller
,
2021/06/11
bug#48963: "guix build guix" halts after exhausting memory
,
Ludovic Courtès
,
2021/06/16
bug#48963: "guix build guix" halts after exhausting memory
,
Julien Lepiller
,
2021/06/17
bug#48963: "guix build guix" halts after exhausting memory
,
Julien Lepiller
,
2021/06/17
bug#48963: "guix build guix" halts after exhausting memory
,
Ludovic Courtès
,
2021/06/18
bug#48963: "guix build guix" halts after exhausting memory
,
Julien Lepiller
,
2021/06/18
bug#48963: "guix build guix" halts after exhausting memory
,
Ludovic Courtès
,
2021/06/20
bug#48963: "guix build guix" halts after exhausting memory
,
Julien Lepiller
,
2021/06/21
bug#48963: "guix build guix" halts after exhausting memory
,
Ludovic Courtès
,
2021/06/23
bug#48959: icecat imcomplete LD_LIBRARY_PATH affecting Kerberos authentication
,
Ignacio Coterillo
,
2021/06/11
bug#48959: icecat imcomplete LD_LIBRARY_PATH affecting Kerberos authentication
,
Mark H Weaver
,
2021/06/14
bug#48959: icecat imcomplete LD_LIBRARY_PATH affecting Kerberos authentication
,
Mark H Weaver
,
2021/06/14
bug#48959: icecat imcomplete LD_LIBRARY_PATH affecting Kerberos authentication
,
Ignacio Coterillo
,
2021/06/15
bug#48959: icecat imcomplete LD_LIBRARY_PATH affecting Kerberos authentication
,
Mark H Weaver
,
2021/06/15
bug#46212: ci.guix.gnu.org narinfos with excessive NarSize
,
Christopher Baines
,
2021/06/11
bug#46212: ci.guix.gnu.org narinfos with excessive NarSize
,
Ludovic Courtès
,
2021/06/18
bug#45238: The section [[info:guix#Invoking guix package]] contradicts itself
,
zimoun
,
2021/06/10
bug#45238: The section [[info:guix#Invoking guix package]] contradicts itself
,
Jorge P . de Morais Neto
,
2021/06/12
bug#45238: The section [[info:guix#Invoking guix package]] contradicts itself
,
zimoun
,
2021/06/14
bug#48457: linkchecker 9.4.0 fails to build
,
zimoun
,
2021/06/10
bug#48457: linkchecker 9.4.0 fails to build
,
Luis Felipe
,
2021/06/10
bug#48457: linkchecker 9.4.0 fails to build
,
zimoun
,
2021/06/10
bug#47739: Mumi: sorting the list of issues by date
,
zimoun
,
2021/06/10
bug#48352: Haskell cabal new-build fails
,
zimoun
,
2021/06/10
bug#48945: PostgreSQL + Cuirass Errors
,
Eric Brown
,
2021/06/10
bug#48945: PostgreSQL + Cuirass Errors
,
Eric Brown
,
2021/06/15
bug#48400: Nyxt build fails because php fails x86_64
,
zimoun
,
2021/06/10
bug#48400: Nyxt build fails because php fails x86_64
,
Christopher Howard
,
2021/06/15
bug#48700: guix import fails with unexpected token
,
zimoun
,
2021/06/10
bug#48700: guix import fails with unexpected token
,
Philip Munksgaard
,
2021/06/10
bug#48700: guix import fails with unexpected token
,
zimoun
,
2021/06/10
bug#48700: guix import fails with unexpected token
,
Philip Munksgaard
,
2021/06/10
bug#48944: haskell build-system cannot build pcg-random
,
Philip Munksgaard
,
2021/06/10
bug#48944: haskell build-system cannot build pcg-random
,
zimoun
,
2021/06/10
bug#48944: haskell build-system cannot build pcg-random
,
John Kehayias
,
2021/06/23
bug#45571: Support stable uids and gids for system accounts in a container
,
Arun Isaac
,
2021/06/10
bug#48941: [powerpc64le-linux] libfaketime CLOCK_MONOTONIC test hangs
,
Chris Marusich
,
2021/06/10
bug#48941: [powerpc64le-linux] libfaketime CLOCK_MONOTONIC test hangs
,
Chris Marusich
,
2021/06/11
bug#45645: Please revoke this commit: 7dd1a2174a8376c521dcf271e3b76f64096074fe
,
zimoun
,
2021/06/09
bug#45645: Please revoke this commit: 7dd1a2174a8376c521dcf271e3b76f64096074fe
,
Leo Prikler
,
2021/06/10
bug#25752: Acknowledgement (go incremental builds broken)
,
zimoun
,
2021/06/09
bug#30290: guix-daemon slows to a crawl when a substitute server is offline
,
zimoun
,
2021/06/09
bug#24083: guix lint doesn't actually fail on some errors
,
zimoun
,
2021/06/09
bug#48935: missing source crypto++
,
zimoun
,
2021/06/09
bug#48935: missing source crypto++
,
zimoun
,
2021/06/09
bug#42148: guix-1.1.0-13.26611f5 fails to build
,
zimoun
,
2021/06/09
bug#47471: missing source emacs-pyim
,
zimoun
,
2021/06/09
bug#43585: Order in manifest and command-line differs
,
zimoun
,
2021/06/09
bug#45165: binutils-mesboot0 fails at configure, cannot find lex
,
kitzman
,
2021/06/09
bug#45165: binutils-mesboot0 fails at configure, cannot find lex
,
kitzman
,
2021/06/09
bug#44675: guix lint: support for spellchecker or basic grammar
,
Vagrant Cascadian
,
2021/06/09
bug#48927: VTK fails to build. (regression)
,
lg188
,
2021/06/08
bug#46333: Install Command Line
,
Tarn Burton
,
2021/06/08
bug#48911: incorrect license for dialog
,
Thomas Dickey
,
2021/06/08
bug#48911: incorrect license for dialog
,
Leo Famulari
,
2021/06/08
bug#48926: Cuirass is not building Mutt
,
Leo Famulari
,
2021/06/08
bug#48926: Cuirass is not building Mutt
,
Mathieu Othacehe
,
2021/06/09
bug#48926: Cuirass is not building Mutt
,
Ludovic Courtès
,
2021/06/18
bug#48926: Cuirass is not building Mutt
,
Mathieu Othacehe
,
2021/06/18
bug#48926: Cuirass is not building Mutt
,
Mathieu Othacehe
,
2021/06/18
bug#48926: Cuirass is not building Mutt
,
Ludovic Courtès
,
2021/06/28
bug#47630: Improve guix manual installation docs
,
Eric Brown
,
2021/06/08
bug#48273: [PATCH] gnu: icedove: Respect parallel-job-count while building.
,
Jonathan Brielmaier
,
2021/06/08
bug#48273: [PATCH] gnu: icedove: Respect parallel-job-count while building.
,
Ludovic Courtès
,
2021/06/18
bug#48273: [PATCH] gnu: icedove: Respect parallel-job-count while building.
,
Jonathan Brielmaier
,
2021/06/24
bug#48649: Guix doesn't boot with LUKS root partition
,
Eric Brown
,
2021/06/08
bug#48649: Guix doesn't boot with LUKS root partition
,
Tobias Geerinckx-Rice
,
2021/06/08
bug#48686: games: pioneer fails to start
,
Eric Brown
,
2021/06/08
bug#48686: games: pioneer fails to start
,
Diego Nicola Barbato
,
2021/06/21
bug#48913: i686-linux-gnu cross-compiler cannot find libgcc_s [core-updates]
,
Maxime Devos
,
2021/06/08
bug#48913: i686-linux-gnu cross-compiler cannot find libgcc_s [core-updates]
,
Maxime Devos
,
2021/06/08
bug#48913: i686-linux-gnu cross-compiler cannot find libgcc_s [core-updates]
,
Maxime Devos
,
2021/06/08
bug#48913: i686-linux-gnu cross-compiler cannot find libgcc_s [core-updates]
,
Ludovic Courtès
,
2021/06/18
bug#49113: aarch64-linux-gnu cross-compiler fails to build [core-updates]
,
Maxime Devos
,
2021/06/19
bug#49113: aarch64-linux-gnu cross-compiler fails to build [core-updates]
,
Maxime Devos
,
2021/06/20
bug#48913: i686-linux-gnu cross-compiler cannot find libgcc_s [core-updates]
,
Maxime Devos
,
2021/06/19
bug#48913: i686-linux-gnu cross-compiler cannot find libgcc_s [core-updates]
,
Maxime Devos
,
2021/06/19
bug#48913: i686-linux-gnu cross-compiler cannot find libgcc_s [core-updates]
,
Maxime Devos
,
2021/06/19
bug#48913: i686-linux-gnu cross-compiler cannot find libgcc_s [core-updates]
,
Ludovic Courtès
,
2021/06/18
bug#47720: bsnes build might be not reproducible
,
Efraim Flashner
,
2021/06/08
bug#47917: Acknowledgement (Guix 1.3.0 'herd start cow-store /mnt' Doesnt work)
,
bo0od
,
2021/06/07
bug#48910: Very slow startup of GTK+ applications
,
Leo Famulari
,
2021/06/07
bug#48910: Very slow startup of GTK+ applications
,
Leo Famulari
,
2021/06/07
bug#48910: Very slow startup of GTK+ applications
,
Leo Famulari
,
2021/06/07
bug#48910: Very slow startup of GTK+ applications
,
Leo Famulari
,
2021/06/07
bug#48910: Very slow startup of GTK+ applications
,
Ludovic Courtès
,
2021/06/18
bug#48389: Guix pull failed
,
Leo Famulari
,
2021/06/07
bug#48907: Debug symbols file name discrepancies
,
Maxim Cournoyer
,
2021/06/07
bug#48907: Debug symbols file name discrepancies
,
Maxim Cournoyer
,
2021/06/07
bug#48907: Debug symbols file name discrepancies
,
Ludovic Courtès
,
2021/06/18
bug#48903: guix substitute: error: TLS error in procedure 'read_from_session_record_port': Error decoding the received TLS packet.
,
Maxim Cournoyer
,
2021/06/07
bug#48903: guix substitute: error: TLS error in procedure 'read_from_session_record_port': Error decoding the received TLS packet.
,
Maxime Devos
,
2021/06/08
bug#48903: guix substitute: error: TLS error in procedure 'read_from_session_record_port': Error decoding the received TLS packet.
,
Ludovic Courtès
,
2021/06/11
bug#49132: guix substitute: backtrace when the network is disabled during substitution
,
Maxime Devos
,
2021/06/20
bug#49132: guix substitute: backtrace when the network is disabled during substitution
,
Ludovic Courtès
,
2021/06/22
bug#48903: guix substitute: error: TLS error in procedure 'read_from_session_record_port': Error decoding the received TLS packet.
,
Maxim Cournoyer
,
2021/06/29
bug#48903: guix substitute: error: TLS error in procedure 'read_from_session_record_port': Error decoding the received TLS packet.
,
Ludovic Courtès
,
2021/06/29
bug#48903: guix substitute: error: TLS error in procedure 'read_from_session_record_port': Error decoding the received TLS packet.
,
Maxim Cournoyer
,
2021/06/30
bug#48739: QEMU SSH hostfwd example from manual doesn't work anymore
,
Eric Brown
,
2021/06/06
bug#48064: texlive-* packages fail to build non-deterministically
,
Thiago Jung Bauermann
,
2021/06/06
bug#48064: texlive-* packages fail to build non-deterministically
,
Ludovic Courtès
,
2021/06/29
bug#48064: texlive-* packages fail to build non-deterministically
,
Ludovic Courtès
,
2021/06/29
bug#48064: [Dev-luatex] bug#48064: texlive-* packages fail to build non-deterministically
,
luigi scarso
,
2021/06/30
bug#48064: texlive-* packages fail to build non-deterministically
,
Thiago Jung Bauermann
,
2021/06/08
bug#48064: texlive-* packages fail to build non-deterministically
,
Ludovic Courtès
,
2021/06/30
Message not available
bug#48064: texlive-* packages fail to build non-deterministically
,
Thiago Jung Bauermann
,
2021/06/30
bug#48064: texlive-* packages fail to build non-deterministically
,
Thiago Jung Bauermann
,
2021/06/29
bug#44872: Installer crash: 'uuid->string' is passed #f in lieu of a UUID
,
David Wilson
,
2021/06/06
bug#44872: Installer crash: 'uuid->string' is passed #f in lieu of a UUID
,
Mathieu Othacehe
,
2021/06/07
bug#44872: Installer crash: 'uuid->string' is passed #f in lieu of a UUID
,
David Wilson
,
2021/06/08
bug#44872: Installer crash: 'uuid->string' is passed #f in lieu of a UUID
,
Mathieu Othacehe
,
2021/06/09
bug#44872: Installer crash: 'uuid->string' is passed #f in lieu of a UUID
,
David Wilson
,
2021/06/09
bug#44872: Installer crash: 'uuid->string' is passed #f in lieu of a UUID
,
Mathieu Othacehe
,
2021/06/12
bug#44872: Installer crash: 'uuid->string' is passed #f in lieu of a UUID
,
David Wilson
,
2021/06/12
bug#44872: Installer crash: 'uuid->string' is passed #f in lieu of a UUID
,
Mathieu Othacehe
,
2021/06/12
bug#44872: Installer crash: 'uuid->string' is passed #f in lieu of a UUID
,
David Wilson
,
2021/06/12
bug#44872: Installer crash: 'uuid->string' is passed #f in lieu of a UUID
,
Mathieu Othacehe
,
2021/06/17
bug#48872: Guix services: ‘chmod’ leaves opportunity to leak secrets
,
Xinglu Chen
,
2021/06/06
bug#48872: Guix services: ‘chmod’ leaves opportunity to leak secrets
,
Maxime Devos
,
2021/06/08
bug#48872: Guix services: ‘chmod’ leaves opportunity to leak secrets
,
Xinglu Chen
,
2021/06/08
bug#48868: VLC cant find libvdpau_radeonsi.so when playing video
,
Brendan Tildesley
,
2021/06/06
bug#48855: Segfault while attempting to use --with-git-url
,
Maxim Cournoyer
,
2021/06/05
bug#48855: Segfault while attempting to use --with-git-url
,
Ludovic Courtès
,
2021/06/26
bug#48855: Segfault while attempting to use --with-git-url
,
Ludovic Courtès
,
2021/06/30
bug#48855: Segfault while attempting to use --with-git-url
,
Maxim Cournoyer
,
2021/06/30
bug#48848: Failure to post a reply through the Web interface.
,
Tony Olagbaiye
,
2021/06/05
bug#48811: R 4.1.0 does not build
,
meedstrom
,
2021/06/05
bug#48811: R 4.1.0 does not build
,
Eric Brown
,
2021/06/08
bug#48811: R 4.1.0 does not build
,
zimoun
,
2021/06/09
Message not available
bug#48811: R 4.1.0 does not build
,
zimoun
,
2021/06/14
bug#39101: asymptote build fails: Math formula deleted: Insufficient symbol fonts.
,
Ricardo Wurmus
,
2021/06/05
bug#39101: asymptote build fails: Math formula deleted: Insufficient symbol fonts.
,
Pierre Neidhardt
,
2021/06/05
bug#48844: emacs-guix: error on by-name package searches
,
Christopher Howard
,
2021/06/05
bug#48273: Icedove 78.10.0 build stuck at 'unpack' phase
,
Jonathan Brielmaier
,
2021/06/04
bug#48273: Icedove 78.10.0 build stuck at 'unpack' phase
,
Mark H Weaver
,
2021/06/04
bug#47698: [powerpc64le-linux] "check" package fails to build
,
Chris Marusich
,
2021/06/04
bug#47698: [powerpc64le-linux] "check" package fails to build
,
Efraim Flashner
,
2021/06/04
bug#47698: [powerpc64le-linux] "check" package fails to build
,
Efraim Flashner
,
2021/06/04
bug#47698: [powerpc64le-linux] "check" package fails to build
,
Efraim Flashner
,
2021/06/08
bug#47698: [powerpc64le-linux] "check" package fails to build
,
Chris Marusich
,
2021/06/18
bug#48819: ‘chicken-build-system’ is not able to deal with specific version of egg
,
Xinglu Chen
,
2021/06/03
bug#47935: coreutils: tests/tail-2/inotify-dir-recreate.sh fails on overlayfs
,
Ludovic Courtès
,
2021/06/03
bug#48808: List of discovered substitute servers not refreshed?
,
Ludovic Courtès
,
2021/06/03
bug#48612: Expat "billion laughs attack" vulnerability (CVE-2013-0340)
,
Leo Famulari
,
2021/06/02
bug#48802: Possibly nonfree font (font-ubuntu)
,
Ron Nazarov
,
2021/06/02
bug#48802: Possibly nonfree font (font-ubuntu)
,
Leo Prikler
,
2021/06/03
bug#48802: Possibly nonfree font (font-ubuntu)
,
Leo Prikler
,
2021/06/03
bug#48796: Guix on Debian 11 - Cant run or find applications from Guix
,
bo0od
,
2021/06/02
bug#48796: Guix on Debian 11 - Cant run or find applications from Guix
,
Maxime Devos
,
2021/06/03
bug#48796: Guix on Debian 11 - Cant run or find applications from Guix
,
bo0od
,
2021/06/03
bug#48796: Guix on Debian 11 - Cant run or find applications from Guix
,
Maxime Devos
,
2021/06/05
bug#48796: Guix on Debian 11 - Cant run or find applications from Guix
,
bo0od
,
2021/06/05
bug#48796: Guix on Debian 11 - Cant run or find applications from Guix
,
Mark H Weaver
,
2021/06/05
bug#48796: Guix on Debian 11 - Cant run or find applications from Guix
,
Giovanni Biscuolo
,
2021/06/17
bug#48794: Add verification instructions to guix .iso
,
bo0od
,
2021/06/02
bug#48794: Add verification instructions to guix .iso
,
Ludovic Courtès
,
2021/06/18
bug#48793: Make guix room available over matrix
,
bo0od
,
2021/06/02
bug#48793: Make guix room available over matrix
,
Julien Lepiller
,
2021/06/02
bug#48793: Make guix room available over matrix
,
bo0od
,
2021/06/02
bug#48793: Make guix room available over matrix
,
Julien Lepiller
,
2021/06/02
bug#48793: Make guix room available over matrix
,
bo0od
,
2021/06/02
bug#48793: Make guix room available over matrix
,
Bone Baboon
,
2021/06/03
bug#48793: Make guix room available over matrix
,
bo0od
,
2021/06/03
bug#48793: Make guix room available over matrix
,
Tobias Geerinckx-Rice
,
2021/06/02
bug#48793: Make guix room available over matrix
,
bo0od
,
2021/06/02
bug#48793: Make guix room available over matrix
,
Tobias Geerinckx-Rice
,
2021/06/02
bug#48793: Make guix room available over matrix
,
bo0od
,
2021/06/03
bug#48793: Make guix room available over matrix
,
Julien Lepiller
,
2021/06/03
bug#48793: Make guix room available over matrix
,
bo0od
,
2021/06/07
bug#48792: CRAN/bioconductor updater downloads tarballs twice
,
Ricardo Wurmus
,
2021/06/02
bug#48792: CRAN/bioconductor updater downloads tarballs twice
,
zimoun
,
2021/06/10
bug#48741: [BUG] Vapoursynth package broken (and outdated)
,
Efraim Flashner
,
2021/06/02
bug#48722: [PATCH] python-hg-evolve update to 10.3.1 for compatibility with new hg
,
Efraim Flashner
,
2021/06/02
bug#48496: Guix reconfigure fails to switch to new system
,
Simon Streit
,
2021/06/01
bug#48496: Guix reconfigure fails to switch to new system
,
Ludovic Courtès
,
2021/06/03
bug#48771: Gnutls fails to build on i586-pc (hurd)
,
Eric Brown
,
2021/06/01
bug#48771: Gnutls fails to build on i586-pc (hurd)
,
Ludovic Courtès
,
2021/06/06
bug#48762: Bug in guix installer (seems to be unable to create swap) - reproducable
,
Mathieu Othacehe
,
2021/06/01
bug#48762: Bug in guix installer (seems to be unable to create swap) - reproducable
,
Ludovic Courtès
,
2021/06/13
bug#48762: Bug in guix installer (seems to be unable to create swap) - reproducable
,
Andrew "Truck" Holland
,
2021/06/13
bug#48778: ‘guix’ package loads all .scm files from its profile
,
Ludovic Courtès
,
2021/06/01
bug#48778: ‘guix’ package loads all .scm files from its profile
,
Ludovic Courtès
,
2021/06/13
bug#48778: ‘guix’ package loads all .scm files from its profile
,
Ludovic Courtès
,
2021/06/22
[
Prev Period
]
[
Next Period
]
Mail converted by
MHonArc