qemu-arm
[Top][All Lists]
Advanced

[Date Prev][Date Next][Thread Prev][Thread Next][Date Index][Thread Index]

Re: [PATCH] hw/sd/allwinner-sdhost: Use AddressSpace for DMA transfers


From: no-reply
Subject: Re: [PATCH] hw/sd/allwinner-sdhost: Use AddressSpace for DMA transfers
Date: Fri, 14 Aug 2020 05:05:02 -0700 (PDT)

Patchew URL: 20200814110057.307-1-f4bug@amsat.org/">https://patchew.org/QEMU/20200814110057.307-1-f4bug@amsat.org/



Hi,

This series failed the docker-quick@centos7 build test. Please find the testing 
commands and
their output below. If you have Docker installed, you can probably reproduce it
locally.

=== TEST SCRIPT BEGIN ===
#!/bin/bash
make docker-image-centos7 V=1 NETWORK=1
time make docker-test-quick@centos7 SHOW_ENV=1 J=14 NETWORK=1
=== TEST SCRIPT END ===

  CC      x86_64-softmmu/target/i386/smm_helper.o
  CC      x86_64-softmmu/target/i386/svm_helper.o
/tmp/qemu-test/src/hw/arm/allwinner-a10.c: In function 'aw_a10_realize':
/tmp/qemu-test/src/hw/arm/allwinner-a10.c:170:30: error: passing argument 2 of 
'object_property_set_link' from incompatible pointer type [-Werror]
                              OBJECT(get_system_memory()), &error_fatal);
                              ^
In file included from /tmp/qemu-test/src/include/exec/memory.h:28:0,
---
/tmp/qemu-test/src/include/qom/object.h:1243:6: note: expected 'struct Object 
*' but argument is of type 'const char *'
 void object_property_set_link(Object *obj, Object *value,
      ^
/tmp/qemu-test/src/hw/arm/allwinner-a10.c:170:30: error: passing argument 3 of 
'object_property_set_link' from incompatible pointer type [-Werror]
                              OBJECT(get_system_memory()), &error_fatal);
                              ^
In file included from /tmp/qemu-test/src/include/exec/memory.h:28:0,
---
 void object_property_set_link(Object *obj, Object *value,
      ^
cc1: all warnings being treated as errors
make[1]: *** [hw/arm/allwinner-a10.o] Error 1
make[1]: *** Waiting for unfinished jobs....
  CC      x86_64-softmmu/target/i386/machine.o
  CC      x86_64-softmmu/target/i386/arch_memory_mapping.o
/tmp/qemu-test/src/hw/arm/allwinner-h3.c: In function 'allwinner_h3_realize':
/tmp/qemu-test/src/hw/arm/allwinner-h3.c:353:30: error: passing argument 2 of 
'object_property_set_link' from incompatible pointer type [-Werror]
                              OBJECT(get_system_memory()), &error_fatal);
                              ^
In file included from /tmp/qemu-test/src/include/exec/memory.h:28:0,
---
/tmp/qemu-test/src/include/qom/object.h:1243:6: note: expected 'struct Object 
*' but argument is of type 'const char *'
 void object_property_set_link(Object *obj, Object *value,
      ^
/tmp/qemu-test/src/hw/arm/allwinner-h3.c:353:30: error: passing argument 3 of 
'object_property_set_link' from incompatible pointer type [-Werror]
                              OBJECT(get_system_memory()), &error_fatal);
                              ^
In file included from /tmp/qemu-test/src/include/exec/memory.h:28:0,
---
 void object_property_set_link(Object *obj, Object *value,
      ^
cc1: all warnings being treated as errors
make[1]: *** [hw/arm/allwinner-h3.o] Error 1
  CC      x86_64-softmmu/target/i386/arch_dump.o
  CC      x86_64-softmmu/target/i386/monitor.o
  CC      x86_64-softmmu/target/i386/kvm.o
---
  CC      x86_64-softmmu/softmmu/main.o
  CC      x86_64-softmmu/gdbstub-xml.o
  CC      x86_64-softmmu/trace/generated-helpers.o
make: *** [aarch64-softmmu/all] Error 2
make: *** Waiting for unfinished jobs....
  LINK    x86_64-softmmu/qemu-system-x86_64
Traceback (most recent call last):
---
    raise CalledProcessError(retcode, cmd)
subprocess.CalledProcessError: Command '['sudo', '-n', 'docker', 'run', 
'--label', 'com.qemu.instance.uuid=db66dd82f40243898ca5fc5874340ff2', '-u', 
'1001', '--security-opt', 'seccomp=unconfined', '--rm', '-e', 'TARGET_LIST=', 
'-e', 'EXTRA_CONFIGURE_OPTS=', '-e', 'V=', '-e', 'J=14', '-e', 'DEBUG=', '-e', 
'SHOW_ENV=1', '-e', 'CCACHE_DIR=/var/tmp/ccache', '-v', 
'/home/patchew/.cache/qemu-docker-ccache:/var/tmp/ccache:z', '-v', 
'/var/tmp/patchew-tester-tmp-_2_0qwhh/src/docker-src.2020-08-14-08.01.24.10929:/var/tmp/qemu:z,ro',
 'qemu:centos7', '/var/tmp/qemu/run', 'test-quick']' returned non-zero exit 
status 2.
filter=--filter=label=com.qemu.instance.uuid=db66dd82f40243898ca5fc5874340ff2
make[1]: *** [docker-run] Error 1
make[1]: Leaving directory `/var/tmp/patchew-tester-tmp-_2_0qwhh/src'
make: *** [docker-run-test-quick@centos7] Error 2

real    3m37.968s
user    0m8.605s


The full log is available at
20200814110057.307-1-f4bug@amsat.org/testing.docker-quick@centos7/?type=message">http://patchew.org/logs/20200814110057.307-1-f4bug@amsat.org/testing.docker-quick@centos7/?type=message.
---
Email generated automatically by Patchew [https://patchew.org/].
Please send your feedback to patchew-devel@redhat.com

reply via email to

[Prev in Thread] Current Thread [Next in Thread]