[Top][All Lists]

[Date Prev][Date Next][Thread Prev][Thread Next][Date Index][Thread Index]

Compilation fails

From: Samir Sharshar
Subject: Compilation fails
Date: Sat, 18 Dec 2004 17:50:10 +0100


I've try to compile octave 2.1.64 on my mac os X 10.3.6 with gcc 3.3. build 1671 from Apple and XL Fortran from IBM.

I've pass -fast option to the c and c++ compiler

I've got the following error when compiled the intepreter section :

make[4]: `DOCSTRINGS' is up to date.
make -C ../../scripts DOCSTRINGS
make[4]: `DOCSTRINGS' is up to date.
making arith.texi from arith.txi
make[3]: *** [arith.texi] Error 138
make[2]: *** [interpreter] Error 2
make[1]: *** [doc] Error 2
make: *** [all] Error 2

Help greatly appreciated


Samir Sharshar MD
INSERM Lille France

Octave is freely available under the terms of the GNU GPL.

Octave's home on the web:
How to fund new projects:
Subscription information:

reply via email to

[Prev in Thread] Current Thread [Next in Thread]