[Top][All Lists]

[Date Prev][Date Next][Thread Prev][Thread Next][Date Index][Thread Index]

octave-2.1.50 with octave-forge-2.1.36

From: John W. Eaton
Subject: octave-2.1.50 with octave-forge-2.1.36
Date: Mon, 28 Jul 2003 15:55:37 -0500

On 28-Jul-2003, T.Sariyski <address@hidden> wrote:

| I just compiled octave-2.1.50 with octave-forge-2.1.36 
| an i386/RedHat9.0. The compilation of octave were fluent.
| make check gave:
| FAIL: octave.test/eval-catch/eval-catch-9.m
| FAIL: octave.test/eval-catch/eval-catch-10.m
| FAIL: octave.test/try/try-9.m
| FAIL: octave.test/try/try-10.m
|                 === octave Summary ===
| # of expected passes            1532
| # of unexpected failures        4
| make[2]: *** [check] Error 1
| make[2]: Leaving directory `/u/ted/octave-2.1.50/test'
| make[1]: *** [check] Error 2
| make[1]: Leaving directory `/u/ted/octave-2.1.50'
| make: *** [check] Error 2
| I don't know how fatal are the above failure but I was able to run 
| octave.

These are known problems that may not be fixed for a while.  Since
this seems to alarm people and has been reported many times, I've
changed the test suite to report them as "expected failures".


Octave is freely available under the terms of the GNU GPL.

Octave's home on the web:
How to fund new projects:
Subscription information:

reply via email to

[Prev in Thread] Current Thread [Next in Thread]