[Top][All Lists]

[Date Prev][Date Next][Thread Prev][Thread Next][Date Index][Thread Index]

SuSe 8.0 compile problems

From: Doug Sturim
Subject: SuSe 8.0 compile problems
Date: Thu, 06 Jun 2002 21:49:20 -0400
User-agent: Mozilla/5.0 (Windows; U; Windows NT 5.0; en-US; rv:1.0.0) Gecko/20020530

Does anyone have a clue to why Suse 8.0 (clean install on a i386) has this compile problem with octave 2.1.35 and 2.1.36. Thanks

../liboctave/liboctave.a(file-ops.o): In function
__default_alloc_template<true, 0> > const &,
basic_string<char, string_char_traits<char>,
__default_alloc_template<true, 0> > const &,
basic_string<char, string_char_traits<char>,
__default_alloc_template<true, 0> > &)':
/root/octave-2.1.36/liboctave/ the use
of `tempnam' is dangerous, better use `mkstemp'
../libcruft/libcruft.a(zbdsqr.o): In function
zbdsqr.o(.text+0x893): undefined reference to `zdrot_'
zbdsqr.o(.text+0x8e3): undefined reference to `zdrot_'
zbdsqr.o(.text+0x92c): undefined reference to `zdrot_'
collect2: ld returned 1 exit status
make[2]: *** [octave] Error 1
make[2]: Leaving directory `/root/octave-2.1.36/src'
make[1]: *** [src] Error 2
make[1]: Leaving directory `/root/octave-2.1.36'
make: *** [all] Error 2

Douglas Sturim          Information Systems Technology Group
address@hidden       MIT Lincoln Laboratory
(781) 981-4462          Lexington, MA 02420-9185

Octave is freely available under the terms of the GNU GPL.

Octave's home on the web:
How to fund new projects:
Subscription information:

reply via email to

[Prev in Thread] Current Thread [Next in Thread]