[Top][All Lists]

[Date Prev][Date Next][Thread Prev][Thread Next][Date Index][Thread Index]

Re: compile problem

From: Toru Mori
Subject: Re: compile problem
Date: Mon, 1 Dec 1997 11:40:02 +0900


At 20:11 97.11.26, Jens Thoms Toerring
<address@hidden wrote:
> /usr/lib/g++-include/std/stddef.h:15: parse error before `::'
> make[2]: *** [CollocWt.o] Error 1
> make[2]: Leaving directory
> `/usr/src/packages/SOURCES/octave-2.0.9/liboctave'
> make[1]: *** [liboctave] Error 2
> make[1]: Leaving directory `/usr/src/packages/SOURCES/octave-2.0.9'
> make: *** [all] Error 2
> I am using gcc- and g77- on a pentium running linux 2.0.30.
> Of course, I looked into stddef.h but couldn't find a double colon at line
> 15 or somewhere near to it. Anybody out there who can tell me what I am doing
> wrong?

I'm afraid that it is not a collect answer...

I faced a same problem when I compiled Octave 2.0.9 on Mklinux system
before. To avoid this error, I deleted all extracted files first and try
again from the beggining, I succed to compile.

I don't know which is wrong about this compile error.

_/_/                Toru Mori                _/_/
_/_/ISUZU Advanced Engineering Center,LTD.   _/_/
_/_/ 8 Tsuchidana,Fujisawa,Kanagawa,252 Japan_/_/
_/_/ Tel:81-466-45-2696 Fax:81-466-45-2405   _/_/          

reply via email to

[Prev in Thread] Current Thread [Next in Thread]