[Top][All Lists]

[Date Prev][Date Next][Thread Prev][Thread Next][Date Index][Thread Index]

Error In Compiling octave-2.0.6 On Linux Platform

From: Habibie Sumargo
Subject: Error In Compiling octave-2.0.6 On Linux Platform
Date: Thu, 5 Jun 1997 10:21:58 -0400 (EDT)

Dear Sirs,

I have just downloaded a copy of the latest release of octave-2.0.6 and
tried to compile it on my Dell Dimension XPS P133c running with RedHat-4.2
Linux OS to no avail.  The following is the error messages that I got:

   gcc -c  -I. -I../.. -I../../liboctave -I../../src -I../../glob
   -I../../libcruft/misc  -DHAVE_CONFIG_H -mieee-fp -Wcast-align 
   -Wcast-qual -Wid-clash-31-Winline -Wmissing-prototypes -Wnested-externs 
   -Wpointer-arith-Wstrict-prototypes -Wwrite-strings -g -O2 -Wall dostop.c
   dostop.c:47: warning: no previous prototype for `dostop_'
   c++ -c  -I. -I../.. -I../../liboctave -I../../src -I../../glob
   -I../../libcruft/misc  -DHAVE_CONFIG_H  -fno-implicit-templates -mieee-fp 
   -Wcast-align-Wcast-qual -Wid-clash-31  -Winline -Wmissing-prototypes 
   -Wnested-externs-Wpointer-arith  -Wstrict-prototypes -Wwrite-strings 
   -Wenum-clash -fno-nonnull-objects -g -O2 -Wall
   cc1plus: Invalid option `-Wenum-clash'
   make[3]: *** [f77-extern.o] Error 1
   rm xstopx.c d1mach.c i1mach.c
   make[3]: Leaving directory
   make[2]: *** [misc] Error 2
   make[2]: Leaving directory
   make[1]: *** [libcruft] Error 2
   make[1]: Leaving directory
   make: *** [all] Error 2

Please kindly help me.  Thank you.


reply via email to

[Prev in Thread] Current Thread [Next in Thread]