[Top][All Lists]

[Date Prev][Date Next][Thread Prev][Thread Next][Date Index][Thread Index]

[gfsd]libgcrypt-1.1.4 : problem make

From: Eric Vanborren
Subject: [gfsd]libgcrypt-1.1.4 : problem make
Date: Mon, 01 Oct 2001 16:43:15 +0200

mkdir .libs
rm -fr .libs/ .libs/libgcrypt.* .libs/libgcrypt.*
(cd . && ln -s misc.lo misc.o)
(cd . && ln -s global.lo global.o)
(cd . && ln -s sexp.lo sexp.o)
(cd . && ln -s stdmem.lo stdmem.o)
(cd . && ln -s secmem.lo secmem.o)
/usr/ccs/bin/ld -G -h -o .libs/ 
misc.lo global.lo sexp.lo stdmem.lo secmem.lo -z allextract
../cipher/.libs/ ../mpi/.libs/ -z defaultextract 
../cipher/.libs/ ../mpi/.libs/ -ldl -lnsl
-lsocket   -lc 
(cd .libs && rm -f && ln -s
(cd .libs && rm -f && ln -s
(cd .libs && rm -f && ln -s ../
gcc -DHAVE_CONFIG_H -I. -I. -I..     -g -O2 -Wall -c testapi.c
/bin/sh ../libtool --mode=link gcc  -g -O2 -Wall  -o testapi  testapi.o -ldl -lnsl  -lsocket
gcc -g -O2 -Wall -o .libs/testapi testapi.o  ./.libs/ -ldl
-lnsl -lsocket -R/usr/local/lib
Undefined                       first referenced
 symbol                             in file
__udiv_qrnnd                        ./.libs/
stpcpy                              ./.libs/
ld: fatal: Symbol referencing errors. No output written to .libs/testapi
collect2: ld returned 1 exit status
make[2]: *** [testapi] Error 1
make[2]: Leaving directory `/app/xnet/libgcrypt-1.1.4.src/src'
make[1]: *** [all-recursive] Error 1
make[1]: Leaving directory `/app/xnet/libgcrypt-1.1.4.src'
make: *** [all-recursive-am] Error 2

Eric Vanborren          
                May The OpenSource be with you !

reply via email to

[Prev in Thread] Current Thread [Next in Thread]