[Top][All Lists]

[Date Prev][Date Next][Thread Prev][Thread Next][Date Index][Thread Index]

[O] error while upgrading to 8.3.5

From: Vikas Rawal
Subject: [O] error while upgrading to 8.3.5
Date: Mon, 25 Jul 2016 06:12:16 +0530

I did the usual "make up2" in my git repository but got the following error 
(just pasting the tail of the log):


Ran 634 tests, 633 results as expected, 1 unexpected (2016-07-25 06:07:28+0530)
7 expected failures

1 unexpected results:
   FAILED  test-org-colview/columns-summary

mk/targets.mk:103: recipe for target 'test-dirty' failed
make[1]: *** [test-dirty] Error 1
make[1]: Leaving directory '/Users/vikas/.emacs.d/src/org-mode'
mk/targets.mk:115: recipe for target 'up2' failed
make: *** [up2] Error 2


What do I do? Re-install?


reply via email to

[Prev in Thread] Current Thread [Next in Thread]