[Top][All Lists]

[Date Prev][Date Next][Thread Prev][Thread Next][Date Index][Thread Index]

Re: [O] failed tests

From: Alan Schmitt
Subject: Re: [O] failed tests
Date: Thu, 10 Sep 2015 15:31:10 +0200
User-agent: Gnus/5.13 (Gnus v5.13) Emacs/24.5 (darwin)

On 2015-09-10 14:33, Nicolas Goaziou <address@hidden> writes:

> Hello,
> Alan Schmitt <address@hidden> writes:
>> I’m now getting two failed tests when compiling org (instead of the
>> expected single failed test about bash):
>> 2 unexpected results:
>>    FAILED  ob-shell/bash-uses-assoc-arrays
>>    FAILED  test-org-babel/indented-cached-org-bracket-link
>> Is this expected?
> I cannot reproduce it, neither http://www.randomsample.de:4457/waterfall
> can.
> Do you run tests interactively? If so, a local setting may interfere
> with the test. Also, what is failing exactly?

The tests are run when I run make (which call up2 according to my

The array one has been discussed before:
http://thread.gmane.org/gmane.emacs.orgmode/87724/focus=87864 and

The babel one is new. Here is the output on my terminal:

--8<---------------cut here---------------start------------->8---
Test test-org-babel/indented-cached-org-bracket-link backtrace:
  (if (unwind-protect (setq value-50001 (let ((default-directory tempo
  (let (form-description-50002) (if (unwind-protect (setq value-50001
  (let ((value-50001 (cl-gensym "ert-form-evaluation-aborted-"))) (let
  (lambda nil (let ((value-50001 (cl-gensym "ert-form-evaluation-abort
  #[0 "\306\307!r\211q\210\310\311\312\313\314\315!\316\"\317\320%DC
  funcall(#[0 "\306\307!r\211q\210\310\311\312\313\314\315!\316\"\31
  ert--run-test-internal([cl-struct-ert--test-execution-info [cl-struc
  #[0 "r\304 q\210\305 )\306\307\310\311\312\313!\314\"\315\316%DC\2
  funcall(#[0 "r\304 q\210\305 )\306\307\310\311\312\313!\314\"\315\
  ert-run-test([cl-struct-ert-test test-org-babel/indented-cached-org-
  ert-run-or-rerun-test([cl-struct-ert--stats "\\(org\\|ob\\)" [[cl-st
  ert-run-tests("\\(org\\|ob\\)" #[385 "\306\307\"\203D\211\211G\310
  (let ((org-id-track-globally t) (org-test-selector (if org-test-sele
  eval((org-test-run-batch-tests org-test-select-re))
  command-line-1(("--eval" "(setq vc-handled-backends nil org-startup-
Test test-org-babel/indented-cached-org-bracket-link condition:
         (org-test-with-temp-text "\n* Test\n  #+<point>BEGIN_SRC emacs-lisp 
:file test.txt :cache yes\n    (message \"test\")\n  #+END_SRC" ... ...)))
          ((default-directory temporary-file-directory))
        (org-test-with-temp-text "\n* Test\n  #+<point>BEGIN_SRC emacs-lisp 
:file test.txt :cache yes\n    (message \"test\")\n  #+END_SRC"
          (string= ... ...)))
      :value nil))
   FAILED  190/581  test-org-babel/indented-cached-org-bracket-link
--8<---------------cut here---------------end--------------->8---

Should I try to run it interactively? If so, are there instructions on
how to do it?



OpenPGP Key ID : 040D0A3B4ED2E5C7
Last week athmospheric CO₂ average (Updated September 6, 2015, Mauna Loa Obs.):
377.86 ppm

Attachment: signature.asc
Description: PGP signature

reply via email to

[Prev in Thread] Current Thread [Next in Thread]