[Top][All Lists]

[Date Prev][Date Next][Thread Prev][Thread Next][Date Index][Thread Index]

[O] test fails on OSX

From: Neuwirth Erich
Subject: [O] test fails on OSX
Date: Sat, 29 Sep 2012 09:31:34 +0200

Sorry for the missing subject in the last message,
here it is again with a subject line.

I just did make up2
And on OSX 10.8.2 and Emacs 24.2 I get:

Ran 208 tests, 207 results as expected, 1 unexpected (2012-09-29 09:27:47+0200)
6 expected failures

1 unexpected results:
  FAILED  test-ob/org-babel-remove-result--results-org

make[1]: *** [test-dirty] Error 1
make: *** [up2] Error 2

Perhaps this is useful information

reply via email to

[Prev in Thread] Current Thread [Next in Thread]