[Top][All Lists]

[Date Prev][Date Next][Thread Prev][Thread Next][Date Index][Thread Index]

[Directvnc-user] Compile error

From: R Dicaire
Subject: [Directvnc-user] Compile error
Date: Sun, 6 Nov 2005 15:19:47 -0500

Hi, new to the list...

I'm trying to compile version 0.7.5 against directfb 0.9.24, I get the
following during make:

-I/usr/include/directfb    -c `test -f 'dfb.c' || echo './'`dfb.c

dfb.c:33: error: syntax error before "caps"
dfb.c:33: warning: data definition has no type or storage class
make[2]: *** [dfb.o] Error 1
make[2]: Leaving directory `/usr/src/directvnc-0.7.5/src'
make[1]: *** [all-recursive] Error 1
make[1]: Leaving directory `/usr/src/directvnc-0.7.5'
make: *** [all] Error 2

Is this an issue with the code, or my directfb installation?

aRDy Music and Rick Dicaire present:

reply via email to

[Prev in Thread] Current Thread [Next in Thread]