[Top][All Lists]
[Date Prev][Date Next][Thread Prev][Thread Next][Date Index][Thread Index]
parted-1.8.8 "make check" failures
From: |
Ken Bell |
Subject: |
parted-1.8.8 "make check" failures |
Date: |
Fri, 14 Dec 2007 21:39:11 -0500 |
User-agent: |
Mutt/1.4.1i |
FYI, below is the result of "make check" after building under Fedora-8.
(Linux x.y.z 2.6.23.8-63.fc8 #1 SMP Wed Nov 21 17:56:40 EST 2007 x86_64
x86_64 x86_64 GNU/Linux)
# make check
Making check in po
make[1]: Entering directory `/opt/src/parted-1.8.8/po'
make[1]: Nothing to be done for `check'.
make[1]: Leaving directory `/opt/src/parted-1.8.8/po'
Making check in lib
make[1]: Entering directory `/opt/src/parted-1.8.8/lib'
make check-am
make[2]: Entering directory `/opt/src/parted-1.8.8/lib'
make[2]: Nothing to be done for `check-am'.
make[2]: Leaving directory `/opt/src/parted-1.8.8/lib'
make[1]: Leaving directory `/opt/src/parted-1.8.8/lib'
Making check in libparted
make[1]: Entering directory `/opt/src/parted-1.8.8/libparted'
Makefile:575: warning: overriding commands for target `linux.lo'
Makefile:568: warning: ignoring old commands for target `linux.lo'
Making check in labels
make[2]: Entering directory `/opt/src/parted-1.8.8/libparted/labels'
make[2]: Nothing to be done for `check'.
make[2]: Leaving directory `/opt/src/parted-1.8.8/libparted/labels'
Making check in fs
make[2]: Entering directory `/opt/src/parted-1.8.8/libparted/fs'
Making check in amiga
make[3]: Entering directory `/opt/src/parted-1.8.8/libparted/fs/amiga'
make[3]: Nothing to be done for `check'.
make[3]: Leaving directory `/opt/src/parted-1.8.8/libparted/fs/amiga'
Making check in ext2
make[3]: Entering directory `/opt/src/parted-1.8.8/libparted/fs/ext2'
make[3]: Nothing to be done for `check'.
make[3]: Leaving directory `/opt/src/parted-1.8.8/libparted/fs/ext2'
Making check in ufs
make[3]: Entering directory `/opt/src/parted-1.8.8/libparted/fs/ufs'
make[3]: Nothing to be done for `check'.
make[3]: Leaving directory `/opt/src/parted-1.8.8/libparted/fs/ufs'
Making check in fat
make[3]: Entering directory `/opt/src/parted-1.8.8/libparted/fs/fat'
make[3]: Nothing to be done for `check'.
make[3]: Leaving directory `/opt/src/parted-1.8.8/libparted/fs/fat'
Making check in ntfs
make[3]: Entering directory `/opt/src/parted-1.8.8/libparted/fs/ntfs'
make[3]: Nothing to be done for `check'.
make[3]: Leaving directory `/opt/src/parted-1.8.8/libparted/fs/ntfs'
Making check in hfs
make[3]: Entering directory `/opt/src/parted-1.8.8/libparted/fs/hfs'
make[3]: Nothing to be done for `check'.
make[3]: Leaving directory `/opt/src/parted-1.8.8/libparted/fs/hfs'
Making check in linux_swap
make[3]: Entering directory `/opt/src/parted-1.8.8/libparted/fs/linux_swap'
make[3]: Nothing to be done for `check'.
make[3]: Leaving directory `/opt/src/parted-1.8.8/libparted/fs/linux_swap'
Making check in xfs
make[3]: Entering directory `/opt/src/parted-1.8.8/libparted/fs/xfs'
make[3]: Nothing to be done for `check'.
make[3]: Leaving directory `/opt/src/parted-1.8.8/libparted/fs/xfs'
Making check in jfs
make[3]: Entering directory `/opt/src/parted-1.8.8/libparted/fs/jfs'
make[3]: Nothing to be done for `check'.
make[3]: Leaving directory `/opt/src/parted-1.8.8/libparted/fs/jfs'
Making check in reiserfs
make[3]: Entering directory `/opt/src/parted-1.8.8/libparted/fs/reiserfs'
make[3]: Nothing to be done for `check'.
make[3]: Leaving directory `/opt/src/parted-1.8.8/libparted/fs/reiserfs'
make[3]: Entering directory `/opt/src/parted-1.8.8/libparted/fs'
make[3]: Nothing to be done for `check-am'.
make[3]: Leaving directory `/opt/src/parted-1.8.8/libparted/fs'
make[2]: Leaving directory `/opt/src/parted-1.8.8/libparted/fs'
Making check in .
make[2]: Entering directory `/opt/src/parted-1.8.8/libparted'
Makefile:575: warning: overriding commands for target `linux.lo'
Makefile:568: warning: ignoring old commands for target `linux.lo'
make[2]: Nothing to be done for `check-am'.
make[2]: Leaving directory `/opt/src/parted-1.8.8/libparted'
make[1]: Leaving directory `/opt/src/parted-1.8.8/libparted'
Making check in parted
make[1]: Entering directory `/opt/src/parted-1.8.8/parted'
make[1]: Nothing to be done for `check'.
make[1]: Leaving directory `/opt/src/parted-1.8.8/parted'
Making check in partprobe
make[1]: Entering directory `/opt/src/parted-1.8.8/partprobe'
make[1]: Nothing to be done for `check'.
make[1]: Leaving directory `/opt/src/parted-1.8.8/partprobe'
Making check in include
make[1]: Entering directory `/opt/src/parted-1.8.8/include'
Making check in parted
make[2]: Entering directory `/opt/src/parted-1.8.8/include/parted'
make[2]: Nothing to be done for `check'.
make[2]: Leaving directory `/opt/src/parted-1.8.8/include/parted'
make[2]: Entering directory `/opt/src/parted-1.8.8/include'
make[2]: Nothing to be done for `check-am'.
make[2]: Leaving directory `/opt/src/parted-1.8.8/include'
make[1]: Leaving directory `/opt/src/parted-1.8.8/include'
Making check in doc
make[1]: Entering directory `/opt/src/parted-1.8.8/doc'
Making check in C
make[2]: Entering directory `/opt/src/parted-1.8.8/doc/C'
make[2]: Nothing to be done for `check'.
make[2]: Leaving directory `/opt/src/parted-1.8.8/doc/C'
Making check in pt_BR
make[2]: Entering directory `/opt/src/parted-1.8.8/doc/pt_BR'
for po in `ls -1 ./*.pt_BR.po 2>/dev/null`; do \
make $(basename ${po%.pt_BR.po}); \
done
make[2]: Leaving directory `/opt/src/parted-1.8.8/doc/pt_BR'
make[2]: Entering directory `/opt/src/parted-1.8.8/doc'
make[2]: Nothing to be done for `check-am'.
make[2]: Leaving directory `/opt/src/parted-1.8.8/doc'
make[1]: Leaving directory `/opt/src/parted-1.8.8/doc'
Making check in debug
make[1]: Entering directory `/opt/src/parted-1.8.8/debug'
Making check in clearfat
make[2]: Entering directory `/opt/src/parted-1.8.8/debug/clearfat'
make[2]: Nothing to be done for `check'.
make[2]: Leaving directory `/opt/src/parted-1.8.8/debug/clearfat'
Making check in test
make[2]: Entering directory `/opt/src/parted-1.8.8/debug/test'
make[2]: Nothing to be done for `check'.
make[2]: Leaving directory `/opt/src/parted-1.8.8/debug/test'
make[2]: Entering directory `/opt/src/parted-1.8.8/debug'
make[2]: Nothing to be done for `check-am'.
make[2]: Leaving directory `/opt/src/parted-1.8.8/debug'
make[1]: Leaving directory `/opt/src/parted-1.8.8/debug'
Making check in tests
make[1]: Entering directory `/opt/src/parted-1.8.8/tests'
make check-TESTS
make[2]: Entering directory `/opt/src/parted-1.8.8/tests'
* ok 1: create the test file
* ok 2: run parted -s FILE mklabel msdos
* ok 3: expect no output
* ok 4: erase the left-over label
* ok 5: run parted mklabel (without -s) on a blank disk
* ok 6: create expected output file
* ok 7: check its "interactive" output
* ok 8: create interactive input
* ok 9: rerun that same command, but now with a preexisting label
* ok 10: normalize the actual output
* ok 11: create expected output file
* ok 12: check its output -- slightly different here, due to prompts
* passed all 12 test(s)
PASS: t0000-basic.sh
* ok 1: setup: create the most basic partition table, manually
* ok 2: print the empty table
* ok 3: prepare actual and expected output
* ok 4: check for expected output
* passed all 4 test(s)
PASS: t0100-print.sh
* ok 1: create a file too small to hold a fat32 file system
* ok 2: label the test disk
* ok 3: expect no output
* ok 4: try/fail to create a file system in too small a space
* ok 5: create expected output file
* ok 6: check for expected failure diagnostic
* ok 7: clean up, preparing for next test
* ok 8: create a file large enough to hold a fat32 file system
* ok 9: label the test disk
* ok 10: expect no output
* ok 11: create an msdos file system
* ok 12: expect no output
* passed all 12 test(s)
PASS: t1000-mkpartfs.sh
* This test requires an erasable device and you have not properly
* set the $DEVICE_TO_ERASE and $DEVICE_TO_ERASE_SIZE envvars.
* skip all tests in t1100
* passed all 0 test(s)
PASS: t1100-busy-label.sh
* ok 1: setup
* ok 2: try to create an ext2 partition that is one byte too small
* ok 3: check for expected diagnostic
* ok 4: create the smallest ext2 partition
* ok 5: setup
* ok 6: create another ext2 file system (this would fail for parted-1.8.7)
* ok 7: expect no output
* ok 8: create a smaller one; this would succeed for parted-1.8.7
* ok 9: expect no output
* passed all 9 test(s)
PASS: t1500-small-ext2.sh
* ok 1: create a file large enough to hold a fat32 file system
* ok 2: label the test disk
* ok 3: expect no output
* ok 4: create a partition
* ok 5: create an msdos file system
* ok 6: expect no output
* ok 7: create a file large enough to hold a fat32 file system
* ok 8: label the test disk
* ok 9: expect no output
* ok 10: create input file
* ok 11: create a partition and a filesystem in the same session
* ok 12: normalize the actual output
* ok 13: check for expected prompt
* ok 14: setup: create and label a device
* ok 15: try to create a file system with invalid type name
* ok 16: normalize the actual output
* ok 17: check for expected diagnostic
* ok 18: setup: create and label a device
* ok 19: try to create an ext2 file system of size 16795000
* ok 20: check for empty output
* ok 21: setup: create and label a device
* ok 22: try to create an ext2 file system of size 16796000
* ok 23: check for empty output
* ok 24: setup: create and label a device
* ok 25: try to create an ext2 file system of size 16796160
* ok 26: check for empty output
* ok 27: setup: create and label a device
* ok 28: try to create an ext2 file system of size 16797000
* ok 29: check for empty output
* ok 30: setup: create and label a device
* ok 31: try to create an ext2 file system of size 16798000
* ok 32: check for empty output
* ok 33: setup: create and label a device
* ok 34: try to create an ext2 file system of size 17154000
* ok 35: check for empty output
* ok 36: setup: create and label a device
* ok 37: try to create an ext2 file system of size 17155000
* ok 38: check for empty output
* ok 39: setup: create and label a device
* ok 40: try to create an ext2 file system of size 17156000
* ok 41: check for empty output
* ok 42: setup: create and label a device
* ok 43: try to create an ext2 file system of size 17157000
* ok 44: check for empty output
* ok 45: setup: create and label a device
* ok 46: try to create an ext2 file system of size 17158000
* ok 47: check for empty output
* ok 48: setup: create and label a device
* ok 49: try to create an ext2 file system of size 25184000
* ok 50: check for empty output
* ok 51: setup: create and label a device
* ok 52: try to create an ext2 file system of size 25185000
* ok 53: check for empty output
* ok 54: setup: create and label a device
* ok 55: try to create an ext2 file system of size 25186000
* ok 56: check for empty output
* ok 57: setup: create and label a device
* ok 58: try to create an ext2 file system of size 25589000
* ok 59: check for empty output
* ok 60: setup: create and label a device
* ok 61: try to create an ext2 file system of size 25589000
* ok 62: check for empty output
* ok 63: setup: create and label a device
* ok 64: try to create an ext2 file system of size 25590000
* ok 65: check for empty output
* passed all 65 test(s)
PASS: t2000-mkfs.sh
* ok 1: setup: label and create a small ext2 partition
* ok 2: try to create another partition in the same place
* ok 3: normalize the actual output
* ok 4: check for expected output
* passed all 4 test(s)
PASS: t3000-constraints.sh
* ok 1: create the test file
* ok 2: run parted -s FILE mklabel msdos
* ok 3: check for empty output
* ok 4: make an ext2 primary partition
* ok 5: check for empty output
* FAIL 6: resize ext2 primary partition
parted -s $dev resize 1 0 $NEW_SIZE > out 2>&1
* FAIL 7: check for empty output
$compare out /dev/null
* failed 2 among 7 test(s)
FAIL: t3100-resize-ext2-partion.sh
===================================
1 of 8 tests failed
Please report to address@hidden
===================================
make[2]: *** [check-TESTS] Error 1
make[2]: Leaving directory `/opt/src/parted-1.8.8/tests'
make[1]: *** [check-am] Error 2
make[1]: Leaving directory `/opt/src/parted-1.8.8/tests'
make: *** [check-recursive] Error 1
#
--
Ken Bell : address@hidden : (212) 678-5526 (v): (212) 678-5552 (fax)
======== : address@hidden : (212) 475-4976 (v)
[Prev in Thread] |
Current Thread |
[Next in Thread] |
- parted-1.8.8 "make check" failures,
Ken Bell <=