Archives are refreshed every 15 minutes - for details, please visit
the main index
.
You can also
download the archives in mbox format
.
bug-guix (thread)
[
Date Index
][
Top
][
All Lists
]
Advanced
[
Prev Period
]
Last Modified: Thu Oct 31 2019 19:43:17 -0400
Threads in reverse chronological order
[
Next Period
]
bug#37504: "legacy" NTP configuration fallback fails
,
T460s laptop
,
2019/10/31
bug#37504: "legacy" NTP configuration fallback fails
,
Marius Bakke
,
2019/10/31
bug#38005: org.gtk.Settings.FileChooser glib schema missing "show-type-column" key
,
Josh Holland
,
2019/10/31
Message not available
bug#38005: Acknowledgement (org.gtk.Settings.FileChooser glib schema missing "show-type-column" key)
,
Josh Holland
,
2019/10/31
bug#37345: Icecat doesn't display numbers on Guix System
,
Matias Jose Seco Baccanelli
,
2019/10/31
bug#35591: Segfault on flatpak remote-add
,
Ben Sturmfels
,
2019/10/31
bug#37999: clang fails to pickup/supply startfiles to ld
,
Carl Dong
,
2019/10/30
bug#37999: clang fails to pickup/supply startfiles to ld
,
Mathieu Othacehe
,
2019/10/31
bug#37999: clang fails to pickup/supply startfiles to ld
,
Bengt Richter
,
2019/10/31
bug#37999: clang fails to pickup/supply startfiles to ld
,
Mathieu Othacehe
,
2019/10/31
bug#37999: clang fails to pickup/supply startfiles to ld
,
Marius Bakke
,
2019/10/31
bug#37996: guile-ssh non-deterministic test failure
,
Mark H Weaver
,
2019/10/30
bug#37989: python2-numpy v0.17.3 fails to build
,
Josh Holland
,
2019/10/30
bug#37989: python2-numpy v0.17.3 fails to build
,
Konrad Hinsen
,
2019/10/30
bug#37989: python2-numpy v0.17.3 fails to build
,
Marius Bakke
,
2019/10/30
bug#37977: Mount options ignored for root file system
,
Guillaume Le Vaillant
,
2019/10/29
bug#37757: Kernel panic upon shutdown
,
Ludovic Courtès
,
2019/10/28
bug#37969: guix is telling me to report this
,
Josh Marshall
,
2019/10/28
bug#37967: guix environment -CN: Operation not permitted mounting host's /var/run/nscd
,
Ivan Vilata i Balaguer
,
2019/10/28
bug#37967: guix environment -CN: Operation not permitted mounting host's /var/run/nscd
,
Ludovic Courtès
,
2019/10/29
bug#37967: guix environment -CN: Operation not permitted mounting host's /var/run/nscd
,
Ivan Vilata i Balaguer
,
2019/10/29
bug#37965: parse-error in latest news entry
,
Eric Bavier
,
2019/10/28
Message not available
bug#37965: parse-error in latest news entry
,
Eric Bavier
,
2019/10/28
bug#37965: parse-error in latest news entry
,
Eric Bavier
,
2019/10/28
bug#37955: warning: '.desktop' file refers to '', which cannot be found
,
Pierre Neidhardt
,
2019/10/28
bug#37949: build failures for fetchmail-6.3.26
,
Arne Babenhauserheide
,
2019/10/27
bug#37949: fixed by updating fetchmail, thanks to nckx
,
Arne Babenhauserheide
,
2019/10/27
bug#37946: pingus build fails: ‘function’ in namespace ‘std’ does not name a template type
,
Pierre Neidhardt
,
2019/10/27
bug#37946: pingus build fails: ‘function’ in namespace ‘std’ does not name a template type
,
Marius Bakke
,
2019/10/30
bug#37946: pingus build fails: ‘function’ in namespace ‘std’ does not name a template type
,
Pierre Neidhardt
,
2019/10/31
bug#37469: meld doesn't start up successfully
,
Tobias Geerinckx-Rice
,
2019/10/27
bug#37942: Insufficient environment wrappers
,
Leo Prikler
,
2019/10/27
bug#37942: Insufficient environment wrappers
,
Tobias Geerinckx-Rice
,
2019/10/27
bug#37940: endless "try upgrading both" cycles
,
Arne Babenhauserheide
,
2019/10/27
bug#37940: endless "try upgrading both" cycles
,
Mark H Weaver
,
2019/10/27
bug#37940: endless "try upgrading both" cycles
,
Ludovic Courtès
,
2019/10/27
bug#37940: endless "try upgrading both" cycles
,
Arne Babenhauserheide
,
2019/10/27
bug#37940: endless "try upgrading both" cycles
,
Danny Milosavljevic
,
2019/10/31
bug#37940: endless "try upgrading both" cycles
,
Diego Nicola Barbato
,
2019/10/30
bug#37939: guix-install.sh: Fails to detect signing key on Debian10.
,
Kai Mertens
,
2019/10/27
bug#37939: guix-install.sh: Fails to detect signing key on Debian10.
,
Bengt Richter
,
2019/10/27
bug#37937: Lollypop missing propagated-input gsettings-desktop-schemas
,
Sam
,
2019/10/26
bug#37937: Lollypop missing propagated-input gsettings-desktop-schemas
,
Tobias Geerinckx-Rice
,
2019/10/26
bug#37935: Erro no upgrade pt-br portuguese
,
Pablo Ferreira
,
2019/10/26
bug#37933: gst* plugins in non-default profile not found by webkitgtk browsers (e.g. epiphany)
,
Pierre Neidhardt
,
2019/10/26
bug#37933: gst* plugins in non-default profile not found by webkitgtk browsers (e.g. epiphany)
,
Marius Bakke
,
2019/10/28
bug#37933: gst* plugins in non-default profile not found by webkitgtk browsers (e.g. epiphany)
,
Pierre Neidhardt
,
2019/10/29
bug#37931: Cannot guix refresh -ru util-linux to get updated lsblk
,
Bengt Richter
,
2019/10/25
bug#37931: Cannot guix refresh -ru util-linux to get updated lsblk
,
Marius Bakke
,
2019/10/28
bug#37929: clojure is not usable out of the box
,
Bradley Haggerty
,
2019/10/25
bug#37929: clojure is not usable out of the box
,
Gábor Boskovits
,
2019/10/25
bug#37929: clojure is not usable out of the box
,
Bradley Haggerty
,
2019/10/26
bug#36375: [PATCH] Re: ‘guix package’ should lock the profile
,
Julien Lepiller
,
2019/10/25
bug#36375: [PATCH] Re: ‘guix package’ should lock the profile
,
Ludovic Courtès
,
2019/10/25
bug#36375: [PATCH] Re: ‘guix package’ should lock the profile
,
Julien Lepiller
,
2019/10/25
bug#24168: Offloading builds does not honor --keep-failed
,
Efraim Flashner
,
2019/10/25
bug#24168: Offloading builds does not honor --keep-failed
,
Ludovic Courtès
,
2019/10/25
bug#24168: Offloading builds does not honor --keep-failed
,
Marius Bakke
,
2019/10/28
bug#37917: Kernel Panic
,
Raghav Gururajan
,
2019/10/25
bug#37917: Kernel Panic
,
pelzflorian (Florian Pelz)
,
2019/10/25
bug#37917: Kernel Panic
,
Jesse Gibbons
,
2019/10/25
bug#37917: Kernel Panic
,
pelzflorian (Florian Pelz)
,
2019/10/25
bug#37917: Kernel Panic
,
Raghav Gururajan
,
2019/10/26
bug#37917: Kernel Panic
,
Jesse Gibbons
,
2019/10/26
bug#37917: Kernel Panic
,
pelzflorian (Florian Pelz)
,
2019/10/27
bug#37917: Kernel Panic
,
pelzflorian (Florian Pelz)
,
2019/10/27
bug#37917: Kernel Panic
,
Ludovic Courtès
,
2019/10/25
bug#37917: Kernel Panic
,
Gábor Boskovits
,
2019/10/25
bug#37917: Kernel Panic
,
Raghav Gururajan
,
2019/10/26
bug#37917: Kernel Panic
,
Raghav Gururajan
,
2019/10/26
bug#37914: guix avahi install fails
,
Bengt Richter
,
2019/10/24
bug#37914: guix avahi install fails
,
Tobias Geerinckx-Rice
,
2019/10/24
bug#37914: guix avahi install fails
,
Bengt Richter
,
2019/10/25
bug#37913: Aisleriot pt-br portuguese
,
Pablo Ferreira
,
2019/10/24
bug#37913: Aisleriot pt-br portuguese
,
ison
,
2019/10/25
bug#37911: Cannot build a system with colord-service.
,
Pierre Langlois
,
2019/10/24
bug#37911: Cannot build a system with colord-service.
,
Pierre Langlois
,
2019/10/24
bug#37911: Cannot build a system with colord-service.
,
Pierre Langlois
,
2019/10/24
bug#37911: Cannot build a system with colord-service.
,
Jack Hill
,
2019/10/24
bug#37911: Cannot build a system with colord-service.
,
Ludovic Courtès
,
2019/10/25
bug#37911: Cannot build a system with colord-service.
,
Tobias Geerinckx-Rice
,
2019/10/24
bug#37905: psmisc-23.2.tar.xz was updated in place
,
Tobias Geerinckx-Rice
,
2019/10/24
bug#37905: (no subject)
,
Tobias Geerinckx-Rice
,
2019/10/24
bug#37904: CPU overheating on recent laptops
,
Ludovic Courtès
,
2019/10/24
bug#37904: CPU overheating on recent laptops
,
Tobias Geerinckx-Rice
,
2019/10/24
bug#37904: CPU overheating on recent laptops
,
Ludovic Courtès
,
2019/10/25
bug#37904: CPU overheating on recent laptops
,
Arne Babenhauserheide
,
2019/10/25
bug#37900: guix invocation induces guile locale error
,
Bengt Richter
,
2019/10/24
bug#37900: guix invocation induces guile locale error
,
Gábor Boskovits
,
2019/10/25
bug#37900: guix invocation induces guile locale error
,
Ludovic Courtès
,
2019/10/25
bug#37900: guix invocation induces guile locale error
,
Gábor Boskovits
,
2019/10/25
bug#37900: guix invocation induces guile locale error
,
Bengt Richter
,
2019/10/25
bug#37897: Bug: Resetting locale settings
,
o . rojon
,
2019/10/23
bug#37897: Bug: Resetting locale settings
,
Tobias Geerinckx-Rice
,
2019/10/23
bug#37897: Bug: Resetting locale settings
,
Ludovic Courtès
,
2019/10/25
bug#37897: Bug: Resetting locale settings
,
o . rojon
,
2019/10/26
bug#37896: Bug: Cannot use `guix pull`
,
o . rojon
,
2019/10/23
bug#37896: setxkbmap has worked
,
o . rojon
,
2019/10/23
bug#37897: bug#37896: setxkbmap has worked
,
Tobias Geerinckx-Rice
,
2019/10/23
bug#37896: Bug: Cannot use `guix pull`
,
Tobias Geerinckx-Rice
,
2019/10/23
bug#37885: simple-scan won't build
,
sirmacik
,
2019/10/23
bug#32835: Icecat is missing fonts (on foreign distro)
,
Mark H Weaver
,
2019/10/23
bug#37882: linux-module-build-system doesn't accept make-flags
,
Efraim Flashner
,
2019/10/23
bug#37882: [PATCH] build-system/linux-module: Accept a #:make-flags keyword.
,
Tobias Geerinckx-Rice
,
2019/10/25
bug#37882: [PATCH] build-system/linux-module: Accept a #:make-flags keyword.
,
Efraim Flashner
,
2019/10/27
bug#37876: Regression in MAKE-GCC-TOOLCHAIN after core-updates merge
,
Carl Dong
,
2019/10/22
bug#37876: Regression in MAKE-GCC-TOOLCHAIN after core-updates merge
,
Ludovic Courtès
,
2019/10/22
bug#37876: Regression in MAKE-GCC-TOOLCHAIN after core-updates merge
,
Carl Dong
,
2019/10/22
bug#37876: Regression in MAKE-GCC-TOOLCHAIN after core-updates merge
,
Carl Dong
,
2019/10/23
bug#37872: GUIXS cannot log in using cyrilic
,
Иван Фарленков
,
2019/10/22
bug#37872: GUIXS cannot log in using cyrilic
,
raingloom
,
2019/10/22
bug#30756: GCC >= 6 '-isystem' and C_INCLUDE_PATH behavior changed, breaking #include_next
,
Carl Dong
,
2019/10/22
bug#37865: guix pull: error: You found a bug:
,
Kai Mertens
,
2019/10/22
bug#37865: guix pull: error: You found a bug:
,
Ludovic Courtès
,
2019/10/22
bug#37865: guix pull: error: You found a bug:
,
Kai Mertens
,
2019/10/23
bug#37865: guix pull: error: You found a bug:
,
Ludovic Courtès
,
2019/10/23
bug#37865: guix pull: error: You found a bug:
,
Kai Mertens
,
2019/10/23
bug#37865: guix pull: error: You found a bug:
,
Efraim Flashner
,
2019/10/23
bug#37865: guix pull: error: You found a bug:
,
Kai Mertens
,
2019/10/24
bug#37865: guix pull: error: You found a bug:
,
Efraim Flashner
,
2019/10/24
bug#37865: guix pull: error: You found a bug:
,
Bengt Richter
,
2019/10/24
bug#37865: guix pull: error: You found a bug:
,
Bengt Richter
,
2019/10/25
bug#37865: guix pull: error: You found a bug:
,
Kai Mertens
,
2019/10/27
bug#37865: guix pull: error: You found a bug:
,
Bengt Richter
,
2019/10/27
bug#37865: guix pull: error: You found a bug:
,
Ludovic Courtès
,
2019/10/24
bug#37867: bug on x86_64-linux AMD box
,
Leo Barge
,
2019/10/22
bug#37867: bug on x86_64-linux AMD box
,
pelzflorian (Florian Pelz)
,
2019/10/23
bug#37867: bug on x86_64-linux AMD box
,
ison
,
2019/10/24
bug#37860: qemu-4.1.0 build failure
,
Danny Milosavljevic
,
2019/10/21
bug#37860: qemu-4.1.0 build failure
,
Danny Milosavljevic
,
2019/10/21
bug#37363: emacs and other programs do not display special characters
,
Miguel Arruga Vivas
,
2019/10/21
bug#29474: Hydra guix tarball build faliure
,
Gábor Boskovits
,
2019/10/21
bug#37851: Grub installation only checks for encrypted /boot folder
,
Miguel Arruga Vivas
,
2019/10/21
bug#37851: Grub installation only checks for encrypted /boot folder
,
Miguel Arruga Vivas
,
2019/10/21
bug#37851: Grub installation only checks for encrypted /boot folder
,
Ludovic Courtès
,
2019/10/22
bug#37851: Grub installation only checks for encrypted /boot folder
,
Miguel Arruga Vivas
,
2019/10/26
bug#37851:
,
Miguel Arruga Vivas
,
2019/10/21
bug#37850: Glib documentation is missing
,
Pierre Neidhardt
,
2019/10/21
bug#37850: Glib documentation is missing
,
Marius Bakke
,
2019/10/23
bug#37850: Glib documentation is missing
,
Pierre Neidhardt
,
2019/10/23
bug#37850: Glib documentation is missing
,
Ludovic Courtès
,
2019/10/25
bug#37850: Glib documentation is missing
,
Pierre Neidhardt
,
2019/10/26
bug#37850: Glib documentation is missing
,
Pierre Neidhardt
,
2019/10/29
bug#37846: @acronym not handled correctly in synopsis or descriptions
,
Christopher Baines
,
2019/10/21
bug#37843: GNOME night light doesn't change colors with GNOME 3.30
,
Jack Hill
,
2019/10/20
bug#37842: Multiple channels with the same name hangs 'guix pull'
,
Maxim Cournoyer
,
2019/10/20
bug#35853: gnome-tweaks can now manage gnome-extentions
,
Jack Hill
,
2019/10/20
bug#35422: LibreOffice builds for me, but not on CI server
,
Ben Sturmfels
,
2019/10/20
bug#37831: GDM has a GNOME entry even when not installed
,
Pierre Neidhardt
,
2019/10/20
bug#37822: guile-fibers build failure
,
Christopher Baines
,
2019/10/19
bug#37822: guile-fibers build failure
,
Christopher Baines
,
2019/10/20
bug#37822: guile-fibers build failure
,
Ludovic Courtès
,
2019/10/22
bug#37822: guile-fibers build failure
,
Christopher Baines
,
2019/10/22
bug#37810: Rust 1.27 and later depends on GDB 8.2
,
Marius Bakke
,
2019/10/18
bug#37804: getmail service documentation error?
,
pelzflorian (Florian Pelz)
,
2019/10/18
bug#37804: getmail service documentation error?
,
Christopher Baines
,
2019/10/18
bug#37804: getmail service documentation error?
,
pelzflorian (Florian Pelz)
,
2019/10/18
bug#37804: getmail service documentation error?
,
pelzflorian (Florian Pelz)
,
2019/10/18
bug#37803: [BUG] installer does seem to know about pep8 patch
,
Kyle Andrews
,
2019/10/17
bug#37803: [BUG] installer does seem to know about pep8 patch
,
P
,
2019/10/18
bug#37801: Possible insight into issue #30756 #include_next bug
,
Carl Dong
,
2019/10/17
bug#37801: Possible insight into issue #30756 #include_next bug
,
Danny Milosavljevic
,
2019/10/17
bug#37801: Possible insight into issue #30756 #include_next bug
,
Carl Dong
,
2019/10/18
bug#37801: Possible insight into issue #30756 #include_next bug
,
Danny Milosavljevic
,
2019/10/19
bug#37800: dbus-system failed
,
Gnu Röoty
,
2019/10/17
bug#37799: dbus-system failed
,
Gnu Röoty
,
2019/10/17
bug#37799: dbus-system failed
,
Julien Lepiller
,
2019/10/17
bug#37799: dbus-system
,
Gnu Röoty
,
2019/10/17
bug#37799: dbus-system
,
Ludovic Courtès
,
2019/10/19
bug#37799: dbus-system
,
Gnu Röoty
,
2019/10/20
bug#37799: dbus-system
,
Ludovic Courtès
,
2019/10/22
bug#37799: dbus-system
,
Gnu Röoty
,
2019/10/22
bug#37799: dbus-system
,
Ludovic Courtès
,
2019/10/25
bug#37799: dbus-system
,
Gnu Röoty
,
2019/10/26
bug#29686: gnu: aspell: Do not ignore GuixOS system profile.
,
Pierre Neidhardt
,
2019/10/17
bug#29686: gnu: aspell: Do not ignore GuixOS system profile.
,
Pierre Neidhardt
,
2019/10/26
bug#29686: gnu: aspell: Do not ignore GuixOS system profile.
,
Ludovic Courtès
,
2019/10/27
bug#29686: gnu: aspell: Do not ignore GuixOS system profile.
,
Pierre Neidhardt
,
2019/10/28
bug#37790: MANPATH missing from non-default profile
,
Pierre Neidhardt
,
2019/10/17
bug#37790: MANPATH missing from non-default profile
,
Ludovic Courtès
,
2019/10/17
bug#37790: MANPATH missing from non-default profile
,
Pierre Neidhardt
,
2019/10/17
bug#37790: MANPATH missing from non-default profile
,
Ludovic Courtès
,
2019/10/17
bug#37790: MANPATH missing from non-default profile
,
Pierre Neidhardt
,
2019/10/18
bug#37789: guix pull: error: You found a bug: the program
,
my glc2
,
2019/10/17
bug#37789: guix pull: error: You found a bug: the program
,
Ludovic Courtès
,
2019/10/17
bug#37789: guix pull: error: You found a bug: the program
,
George Clemmer
,
2019/10/17
bug#37789: guix pull: error: You found a bug: the program
,
Ludovic Courtès
,
2019/10/17
bug#37789: guix pull: error: You found a bug: the program
,
George Clemmer
,
2019/10/18
bug#37789: guix pull: error: You found a bug: the program
,
Ludovic Courtès
,
2019/10/19
bug#37789: guix pull: error: You found a bug: the program
,
George Clemmer
,
2019/10/19
bug#37789: guix pull: error: You found a bug: the program
,
Ludovic Courtès
,
2019/10/19
bug#37789: guix pull: error: You found a bug: the program
,
George Clemmer
,
2019/10/21
bug#37789: guix pull: error: You found a bug: the program
,
George Clemmer
,
2019/10/21
bug#37789: guix pull: error: You found a bug: the program
,
Ludovic Courtès
,
2019/10/23
bug#37789: guix pull: error: You found a bug: the program
,
George Clemmer
,
2019/10/23
bug#37779: encfs build fails: stdlib.h: No such file or directory
,
Pierre Neidhardt
,
2019/10/16
bug#37779: encfs build fails: stdlib.h: No such file or directory
,
Marius Bakke
,
2019/10/18
bug#37779: encfs build fails: stdlib.h: No such file or directory
,
Pierre Neidhardt
,
2019/10/18
bug#37778: ucl build fails: ACC conformance test failed.
,
Pierre Neidhardt
,
2019/10/16
bug#37778: ucl build fails: ACC conformance test failed.
,
Marius Bakke
,
2019/10/18
bug#37778: ucl build fails: ACC conformance test failed.
,
Pierre Neidhardt
,
2019/10/18
bug#37775: Python 2.7 not configured for Tk
,
Brian Leung
,
2019/10/16
bug#37775: Python 2.7 not configured for Tk
,
Jesse Gibbons
,
2019/10/16
bug#37775: Python 2.7 not configured for Tk
,
Brian Leung
,
2019/10/16
bug#37765: Trivial rust 1.37.0-compiled program immediately segfaults on newest master
,
Danny Milosavljevic
,
2019/10/15
bug#37765: Trivial rust 1.37.0-compiled program immediately segfaults on newest master
,
Danny Milosavljevic
,
2019/10/15
bug#36965: Streamlink now works fine
,
Josh Holland
,
2019/10/15
bug#36965: Streamlink now works fine
,
Marius Bakke
,
2019/10/15
bug#37762: ‘guix offload’ sets too short a timeout
,
Ludovic Courtès
,
2019/10/15
bug#37762: ‘guix offload’ sets too short a timeout
,
Ludovic Courtès
,
2019/10/15
bug#37761: man pages not displaying on Guix System 1.0.1 fresh install
,
Kenan Toker
,
2019/10/15
bug#37759: network-manager-openvpn broken since network-manager-applet update
,
Jelle Licht
,
2019/10/15
bug#37759: network-manager-openvpn broken since network-manager-applet update
,
Tobias Geerinckx-Rice
,
2019/10/15
bug#37748: 'guix' fails tests on non-x86_64 systems
,
Marius Bakke
,
2019/10/14
bug#37748: 'guix' fails tests on non-x86_64 systems
,
Ludovic Courtès
,
2019/10/14
bug#37748: 'guix' fails tests on non-x86_64 systems
,
Ludovic Courtès
,
2019/10/15
bug#37744: Per-user profile directory hijack (CVE-2019-17365 for Nix)
,
Ludovic Courtès
,
2019/10/14
bug#37744: Per-user profile directory hijack (CVE-2019-17365 for Nix)
,
Ludovic Courtès
,
2019/10/14
bug#37744: Per-user profile directory hijack (CVE-2019-17365 for Nix)
,
Tobias Geerinckx-Rice
,
2019/10/14
bug#37744: Per-user profile directory hijack (CVE-2019-17365 for Nix)
,
Maxim Cournoyer
,
2019/10/14
bug#37744: Per-user profile directory hijack (CVE-2019-17365 for Nix)
,
Ludovic Courtès
,
2019/10/15
bug#37744: Per-user profile directory hijack (CVE-2019-17365 for Nix)
,
Tobias Geerinckx-Rice
,
2019/10/15
bug#37744: Per-user profile directory hijack (CVE-2019-17365 for Nix)
,
Ludovic Courtès
,
2019/10/16
bug#37744: Per-user profile directory hijack (CVE-2019-17365 for Nix)
,
Ludovic Courtès
,
2019/10/16
bug#37744: Per-user profile directory hijack (CVE-2019-17365 for Nix)
,
Ludovic Courtès
,
2019/10/16
bug#37744: Per-user profile directory hijack (CVE-2019-17365 for Nix)
,
pelzflorian (Florian Pelz)
,
2019/10/16
bug#37744: Per-user profile directory hijack (CVE-2019-17365 for Nix)
,
Tobias Geerinckx-Rice
,
2019/10/16
bug#37744: Per-user profile directory hijack (CVE-2019-17365 for Nix)
,
pelzflorian (Florian Pelz)
,
2019/10/16
bug#37744: Per-user profile directory hijack (CVE-2019-17365 for Nix)
,
Tobias Geerinckx-Rice
,
2019/10/16
bug#37744: Per-user profile directory hijack (CVE-2019-17365 for Nix)
,
Ludovic Courtès
,
2019/10/16
bug#37744: Per-user profile directory hijack (CVE-2019-17365 for Nix)
,
Tobias Geerinckx-Rice
,
2019/10/16
bug#37744: Per-user profile directory hijack (CVE-2019-17365 for Nix)
,
Tobias Geerinckx-Rice
,
2019/10/16
bug#37744: Per-user profile directory hijack (CVE-2019-17365 for Nix)
,
Ludovic Courtès
,
2019/10/16
bug#37744: Per-user profile directory hijack (CVE-2019-17365 for Nix)
,
Ludovic Courtès
,
2019/10/16
bug#37744: Per-user profile directory hijack (CVE-2019-17365 for Nix)
,
Julien Lepiller
,
2019/10/16
bug#37744: Per-user profile directory hijack (CVE-2019-17365 for Nix)
,
Ludovic Courtès
,
2019/10/16
bug#37744: Per-user profile directory hijack (CVE-2019-17365 for Nix)
,
pelzflorian (Florian Pelz)
,
2019/10/16
bug#37744: Per-user profile directory hijack (CVE-2019-17365 for Nix)
,
Ludovic Courtès
,
2019/10/16
bug#37744: Per-user profile directory hijack (CVE-2019-17365 for Nix)
,
pelzflorian (Florian Pelz)
,
2019/10/16
bug#37744: Per-user profile directory hijack (CVE-2019-17365 for Nix)
,
pelzflorian (Florian Pelz)
,
2019/10/16
bug#37744: Per-user profile directory hijack (CVE-2019-17365 for Nix)
,
Ludovic Courtès
,
2019/10/16
bug#37744: Per-user profile directory hijack (CVE-2019-17365 for Nix)
,
Ludovic Courtès
,
2019/10/17
bug#37744: Per-user profile directory hijack (CVE-2019-17365 for Nix)
,
Tobias Geerinckx-Rice
,
2019/10/17
bug#37744: Per-user profile directory hijack (CVE-2019-17365 for Nix)
,
Ludovic Courtès
,
2019/10/17
bug#37744: Per-user profile directory hijack (CVE-2019-17365 for Nix)
,
Bengt Richter
,
2019/10/17
bug#37744: Per-user profile directory hijack (CVE-2019-17365 for Nix)
,
Ludovic Courtès
,
2019/10/18
bug#37744: Per-user profile directory hijack (CVE-2019-17365 for Nix)
,
Bengt Richter
,
2019/10/18
bug#37744: Per-user profile directory hijack (CVE-2019-17365 for Nix)
,
Tobias Geerinckx-Rice
,
2019/10/16
bug#37744: Per-user profile directory hijack (CVE-2019-17365 for Nix)
,
Ludovic Courtès
,
2019/10/16
bug#37744: Per-user profile directory hijack (CVE-2019-17365 for Nix)
,
Julien Lepiller
,
2019/10/16
bug#37740: Deja-dup fails to build on c2734ff80987de8f0bb3e31d4339e5496a9821d2
,
goodoldpaul
,
2019/10/13
bug#37740: Deja-dup fails to build on c2734ff80987de8f0bb3e31d4339e5496a9821d2
,
P
,
2019/10/14
bug#37740: Deja-dup fails to build on c2734ff80987de8f0bb3e31d4339e5496a9821d2
,
P
,
2019/10/15
bug#37740: Deja-dup fails to build on c2734ff80987de8f0bb3e31d4339e5496a9821d2
,
P
,
2019/10/15
bug#37739: System install issue: 'You have a memory leak'
,
Seswu M. Fafnan
,
2019/10/13
bug#37739: System install issue: 'You have a memory leak'
,
Ludovic Courtès
,
2019/10/13
bug#37739: System install issue: 'You have a memory leak'
,
Seswu M. Fafnan
,
2019/10/14
bug#37739: System install issue: 'You have a memory leak'
,
Ludovic Courtès
,
2019/10/16
bug#37739: System install issue: 'You have a memory leak'
,
Seswu M. Fafnan
,
2019/10/17
Message not available
bug#37739: Acknowledgement (System install issue: 'You have a memory leak')
,
Seswu M. Fafnan
,
2019/10/14
bug#37737: Documentation should mention that source checkout must be readable by the guixbuild group if guix-daemon is run from there
,
David Truby
,
2019/10/13
bug#37735: Ansible package build/installation failing
,
Jonathan Frederickson
,
2019/10/13
Message not available
bug#37735: Acknowledgement (Ansible package build/installation failing)
,
Jonathan Frederickson
,
2019/10/13
bug#37735: Ansible package build/installation failing
,
Arun Isaac
,
2019/10/14
bug#37735: Ansible package build/installation failing
,
Arun Isaac
,
2019/10/15
bug#37734: Mate doesn't work after guix pull
,
Jan
,
2019/10/13
bug#37732: mps-youtube propagates util-linux
,
Diego Nicola Barbato
,
2019/10/13
bug#37732: mps-youtube propagates util-linux
,
Marius Bakke
,
2019/10/13
bug#37732: mps-youtube propagates util-linux
,
Diego Nicola Barbato
,
2019/10/15
bug#37721: build failure: parted 3.3
,
Jesse Gibbons
,
2019/10/12
bug#37721: build failure: parted 3.3
,
Jesse Gibbons
,
2019/10/12
bug#37721: build failure: parted 3.3
,
Jesse Gibbons
,
2019/10/12
bug#37721: build failure: parted 3.3
,
Marius Bakke
,
2019/10/13
bug#37721: build failure: parted 3.3
,
Tobias Geerinckx-Rice
,
2019/10/13
bug#37721: build failure: parted 3.3
,
Jesse Gibbons
,
2019/10/13
bug#37715: [BUG] build failure for simple-scan-3.24.1
,
Kyle Andrews
,
2019/10/12
bug#37705: [bug#37707] [PATCH] gnu: python-scikit-learn: Update to 0.20.4
,
Marius Bakke
,
2019/10/12
bug#34565: ungoogled-chromium contains Widevine DRM
,
ng0
,
2019/10/12
bug#34565: ungoogled-chromium may contain Widevine DRM
,
Marius Bakke
,
2019/10/12
bug#37709: Unable to access Network Folders in GNOME
,
Raghav Gururajan
,
2019/10/11
bug#37304: done
,
Brian Leung
,
2019/10/11
bug#37705: python-scikit-learn fails tests
,
Jesse Gibbons
,
2019/10/11
bug#37705: python-scikit-learn fails tests
,
Jesse Gibbons
,
2019/10/11
bug#37705: python-scikit-learn fails tests
,
Ricardo Wurmus
,
2019/10/11
bug#37705: python-scikit-learn fails tests
,
Ricardo Wurmus
,
2019/10/11
bug#37705: bug#37433: bug#37705: python-scikit-learn fails tests
,
Jesse Gibbons
,
2019/10/11
bug#37433: 37433 fixed
,
Jesse Gibbons
,
2019/10/12
bug#37695: `guix pull` fails to build guix-daemon
,
Steven vanZyl
,
2019/10/10
bug#37695: Issue Fixed
,
Steven vanZyl
,
2019/10/10
bug#37695: Issue Fixed
,
Tobias Geerinckx-Rice
,
2019/10/10
bug#37694: Problem with guix pull from local repository
,
Tim Gesthuizen
,
2019/10/10
bug#37694: Problem with guix pull from local repository
,
Marius Bakke
,
2019/10/10
bug#37694: Problem with guix pull from local repository
,
Jan
,
2019/10/10
bug#37694: Problem with guix pull from local repository
,
Marius Bakke
,
2019/10/10
bug#37694: Problem with guix pull from local repository
,
Jan
,
2019/10/10
bug#37694: Problem with guix pull from local repository
,
Tobias Geerinckx-Rice
,
2019/10/10
bug#37694: Problem with guix pull from local repository
,
Ludovic Courtès
,
2019/10/10
bug#37692: quaternion cannot get pages
,
Jesse Gibbons
,
2019/10/10
bug#37692: quaternion not displaying anything
,
Jesse Gibbons
,
2019/10/14
bug#37692: quaternion not displaying anything
,
Tobias Geerinckx-Rice
,
2019/10/14
Message not available
bug#37692: quaternion not displaying anything
,
Tobias Geerinckx-Rice
,
2019/10/15
bug#37688: "guix system reconfigure" doesn't work with LC_ALL=C - and locale problems
,
Danny Milosavljevic
,
2019/10/09
bug#37688: "guix system reconfigure" doesn't work with LC_ALL=C - and locale problems
,
Danny Milosavljevic
,
2019/10/09
bug#37687: simple-scan build failure
,
Danny Milosavljevic
,
2019/10/09
bug#37687: simple-scan build failure
,
Tobias Geerinckx-Rice
,
2019/10/24
bug#34580: Service ssh-daemon could not be started
,
Brant Gardner
,
2019/10/09
bug#34580: Service ssh-daemon could not be started
,
Ludovic Courtès
,
2019/10/11
bug#34580: Service ssh-daemon could not be started
,
Brant Gardner
,
2019/10/12
bug#37682: weston 6.0.1 build failure
,
Bradley Haggerty
,
2019/10/09
bug#37682: weston 6.0.1 build failure
,
Marius Bakke
,
2019/10/24
bug#37682: weston 6.0.1 build failure
,
Gábor Boskovits
,
2019/10/24
bug#37682: weston 6.0.1 build failure
,
Gábor Boskovits
,
2019/10/25
bug#37680: [core-updates] simple-scan fails to build
,
Björn Höfling
,
2019/10/09
bug#37680: simple-scan builds with newer version
,
Jack Hill
,
2019/10/10
bug#37680: simple-scan builds with newer version
,
Björn Höfling
,
2019/10/10
bug#37680: [PATCH] gnu: simple-scan: Update to 3.34.1
,
Jack Hill
,
2019/10/10
bug#37679: Local git configuration interferes with testsuite
,
Gábor Boskovits
,
2019/10/09
bug#37678: python-binaryornot build failure
,
Danny Milosavljevic
,
2019/10/09
bug#37678: python-binaryornot build failure
,
Danny Milosavljevic
,
2019/10/09
bug#37676: Matt, here is kind question to provide facts on your statements about RMS
,
Jean Louis
,
2019/10/09
bug#37675: Ricardo, here is kind question to provide facts on your statements about RMS
,
Jean Louis
,
2019/10/09
bug#37677: Andreas, here is kind question to provide facts on your statements about RMS
,
Jean Louis
,
2019/10/09
bug#37674: Kind question to provide facts on your statements about RMS
,
Jean Louis
,
2019/10/09
bug#37672: espeak 1.48.04 build failure
,
Bradley Haggerty
,
2019/10/09
bug#37672: espeak 1.48.04 build failure
,
Bradley Haggerty
,
2019/10/09
bug#37672: espeak 1.48.04 build failure
,
Marius Bakke
,
2019/10/09
bug#37669: guile: warning: failed to install locale
,
Jesse Gibbons
,
2019/10/08
bug#37669: guile: warning: failed to install locale
,
Gábor Boskovits
,
2019/10/09
bug#37669: guile: warning: failed to install locale
,
Ludovic Courtès
,
2019/10/10
bug#37669: guile: warning: failed to install locale
,
Jesse Gibbons
,
2019/10/10
bug#37669: guile: warning: failed to install locale
,
Ludovic Courtès
,
2019/10/10
bug#37668: can't build mate-applets-1.22.0 after merging the core-updates branch
,
Jan Wielkiewicz
,
2019/10/08
bug#37668: can't build mate-applets-1.22.0 after merging the core-updates branch
,
Marius Bakke
,
2019/10/08
bug#37662: substitution failure of nss-certs
,
Josh Holland
,
2019/10/08
bug#37662: substitution failure of nss-certs
,
Ludovic Courtès
,
2019/10/10
bug#37662: substitution failure of nss-certs
,
Josh Holland
,
2019/10/15
bug#37662: substitution failure of nss-certs
,
Arun Isaac
,
2019/10/15
bug#37662: substitution failure of nss-certs
,
Josh Holland
,
2019/10/16
bug#37662: substitution failure of nss-certs
,
Ben Sturmfels
,
2019/10/17
bug#37662: substitution failure of nss-certs
,
Ludovic Courtès
,
2019/10/17
bug#37662: substitution failure of nss-certs
,
Ludovic Courtès
,
2019/10/16
bug#37662: substitution failure of nss-certs
,
Josh Holland
,
2019/10/16
bug#37662: substitution failure of nss-certs
,
Bengt Richter
,
2019/10/16
bug#37662: substitution failure of nss-certs
,
Ludovic Courtès
,
2019/10/17
bug#37662: substitution failure of nss-certs
,
Josh Holland
,
2019/10/17
bug#37662: substitution failure of nss-certs
,
Ludovic Courtès
,
2019/10/17
bug#35357: udev - ${exec_prefix} left over somewhere
,
Leo Famulari
,
2019/10/07
bug#26302: [website] translations
,
pelzflorian (Florian Pelz)
,
2019/10/07
bug#26302: [website] translations
,
pelzflorian (Florian Pelz)
,
2019/10/08
bug#26302: [website] translations
,
Ludovic Courtès
,
2019/10/22
bug#26302: [website] translations
,
pelzflorian (Florian Pelz)
,
2019/10/22
bug#26302: [website] translations
,
pelzflorian (Florian Pelz)
,
2019/10/22
bug#26302: [website] translations
,
Ludovic Courtès
,
2019/10/23
bug#26302: [website] translations
,
pelzflorian (Florian Pelz)
,
2019/10/23
bug#26302: [website] translations
,
pelzflorian (Florian Pelz)
,
2019/10/22
bug#26302: [website] translations
,
pelzflorian (Florian Pelz)
,
2019/10/31
bug#37449: Bug when using non-trivial inferiors/channel setup
,
Ludovic Courtès
,
2019/10/06
bug#32770: Packaging SLIME/SWANK as Common Lisp library
,
Pierre Neidhardt
,
2019/10/06
bug#37533: waybar fails to build
,
Bradley Haggerty
,
2019/10/06
bug#37533: waybar fails to build
,
Efraim Flashner
,
2019/10/06
bug#37533: waybar fails to build
,
Efraim Flashner
,
2019/10/18
bug#37631: service zabbix-server (and zabbix-agent) fails starting (cannot run as root!)
,
Giovanni Biscuolo
,
2019/10/05
bug#37631: service zabbix-server (and zabbix-agent) fails starting (cannot run as root!)
,
Giovanni Biscuolo
,
2019/10/05
bug#37631: service zabbix-server (and zabbix-agent) fails starting (cannot run as root!)
,
Gábor Boskovits
,
2019/10/05
bug#37631: service zabbix-server (and zabbix-agent) fails starting (cannot run as root!)
,
Giovanni Biscuolo
,
2019/10/05
bug#36634: Virtual Machine Manager (virt-manager)
,
Chris Marusich
,
2019/10/05
bug#36634: Virtual Machine Manager (virt-manager)
,
Chris Marusich
,
2019/10/10
bug#36634: Virtual Machine Manager (virt-manager)
,
Miguel Arruga Vivas
,
2019/10/21
bug#36634: Virtual Machine Manager (virt-manager)
,
Miguel Arruga Vivas
,
2019/10/27
bug#37244: Icecat Audio Issues
,
sirgazil
,
2019/10/04
bug#37616: Libgcrypt warning: missing initialization
,
Hartmut Goebel
,
2019/10/04
bug#37612: device-mapper: remove ioctl on cryptoroot failed: Device or resource busy
,
theamazed74
,
2019/10/04
bug#37612: Markdown
,
theamazed74
,
2019/10/04
bug#37492: GUIXSD 1.0.1 install error
,
RAUL H C LOPES
,
2019/10/03
bug#37492: GUIXSD 1.0.1 install error
,
RAUL H C LOPES
,
2019/10/17
bug#37492: GUIXSD 1.0.1 install error
,
Marius Bakke
,
2019/10/17
bug#37531: ‘%load-path’ in shepherd is unnecessarily long
,
Ludovic Courtès
,
2019/10/03
bug#37347: 'guix environment' fails after trying to follow the steps from "Running Guix Before It Is Installed" page
,
Jan Wielkiewicz
,
2019/10/03
bug#37347: 'guix environment' fails after trying to follow the steps from "Running Guix Before It Is Installed" page
,
Bengt Richter
,
2019/10/03
bug#37347: 'guix environment' fails after trying to follow the steps from "Running Guix Before It Is Installed" page
,
Bengt Richter
,
2019/10/03
bug#37347: 'guix environment' fails after trying to follow the steps from "Running Guix Before It Is Installed" page
,
Jelle Licht
,
2019/10/04
bug#37347: 'guix environment' fails after trying to follow the steps from "Running Guix Before It Is Installed" page
,
Bengt Richter
,
2019/10/04
bug#37347: 'guix environment' fails after trying to follow the steps from "Running Guix Before It Is Installed" page
,
Marius Bakke
,
2019/10/05
bug#37347: 'guix environment' fails after trying to follow the steps from "Running Guix Before It Is Installed" page
,
Jan Wielkiewicz
,
2019/10/06
bug#37347: 'guix environment' fails after trying to follow the steps from "Running Guix Before It Is Installed" page
,
Gábor Boskovits
,
2019/10/24
bug#37606: CI reports "failed" even if build succeeds
,
Hartmut Goebel
,
2019/10/03
bug#37606: CI reports "failed" even if build succeeds
,
Marius Bakke
,
2019/10/08
bug#37605: [core-updates] MariaDB fails tests on armhf-linux
,
Marius Bakke
,
2019/10/03
bug#37605: [core-updates] MariaDB fails tests on armhf-linux
,
Marius Bakke
,
2019/10/05
bug#37605: [core-updates] MariaDB fails tests on armhf-linux
,
Ludovic Courtès
,
2019/10/08
bug#37605: [core-updates] MariaDB fails tests on armhf-linux
,
Marius Bakke
,
2019/10/08
Message not available
bug#37605: closed (Re: [core-updates] MariaDB fails tests on armhf-linux)
,
Ludovic Courtès
,
2019/10/08
bug#37369: Getting network-manager-openconnect to work
,
Divan Santana
,
2019/10/03
bug#37596: ‘guix system roll-back’ doesn’t reload services
,
Ludovic Courtès
,
2019/10/03
bug#37593: [core-updates] Linux-Libre fails to build on aarch64-linux
,
Marius Bakke
,
2019/10/02
bug#37593: [core-updates] Linux-Libre fails to build on aarch64-linux
,
Pierre Langlois
,
2019/10/02
bug#37593: [core-updates] Linux-Libre fails to build on aarch64-linux
,
Marius Bakke
,
2019/10/05
bug#37593: [core-updates] Linux-Libre fails to build on aarch64-linux
,
Gábor Boskovits
,
2019/10/05
bug#37593: [core-updates] Linux-Libre fails to build on aarch64-linux
,
Marius Bakke
,
2019/10/06
bug#37588: Installation error 'emacs-matrix-client'
,
SuarezMiguelC
,
2019/10/02
bug#37588: Installation error 'emacs-matrix-client'
,
Ludovic Courtès
,
2019/10/06
bug#37586: Import cycles in unrelated packages should not be an error
,
pelzflorian (Florian Pelz)
,
2019/10/02
bug#37586: Import cycles in unrelated packages should not be an error
,
Ludovic Courtès
,
2019/10/06
bug#37586: Import cycles in unrelated packages should not be an error
,
pelzflorian (Florian Pelz)
,
2019/10/06
bug#37583: Documentation needed: pam-services in operating-system structure
,
Jesse Gibbons
,
2019/10/02
bug#37501: [core-updates] Entropy starvation during boot
,
Ludovic Courtès
,
2019/10/02
bug#37501: [core-updates] Entropy starvation during boot
,
Ludovic Courtès
,
2019/10/02
bug#37501: [core-updates] Entropy starvation during boot
,
Marius Bakke
,
2019/10/03
bug#37501: [core-updates] Entropy starvation during boot
,
Ludovic Courtès
,
2019/10/04
bug#37501: [core-updates] Entropy starvation during boot
,
Ludovic Courtès
,
2019/10/04
bug#37501: [core-updates] Entropy starvation during boot
,
Ludovic Courtès
,
2019/10/04
bug#37501: [core-updates] Entropy starvation during boot
,
Marius Bakke
,
2019/10/05
bug#37501: [core-updates] Entropy starvation during boot
,
Ludovic Courtès
,
2019/10/05
bug#37501: [core-updates] Entropy starvation during boot
,
Marius Bakke
,
2019/10/06
bug#37501: [core-updates] Entropy starvation during boot
,
Marius Bakke
,
2019/10/06
bug#37501: [core-updates] Entropy starvation during boot
,
Ludovic Courtès
,
2019/10/06
bug#37503: dconf-editor build fails on core-updates
,
Ludovic Courtès
,
2019/10/02
bug#37545: epiphany and next broken after webkitgtk upgrade to 2.26.1
,
Ludovic Courtès
,
2019/10/02
bug#37545: epiphany and next broken after webkitgtk upgrade to 2.26.1
,
Vagrant Cascadian
,
2019/10/02
bug#37545: epiphany and next broken after webkitgtk upgrade to 2.26.1
,
Marius Bakke
,
2019/10/06
bug#37545: epiphany and next broken after webkitgtk upgrade to 2.26.1
,
Vagrant Cascadian
,
2019/10/08
bug#37545: epiphany and next broken after webkitgtk upgrade to 2.26.1
,
Bradley Haggerty
,
2019/10/08
bug#37545: epiphany and next broken after webkitgtk upgrade to 2.26.1
,
Marius Bakke
,
2019/10/08
bug#37506: [core-updates] Inferiors cannot reference master branch
,
Ludovic Courtès
,
2019/10/02
bug#37569: Mount does not honor 'user' option.
,
Diego Nicola Barbato
,
2019/10/01
bug#37569: Mount does not honor 'user' option.
,
Danny Milosavljevic
,
2019/10/01
bug#37569: Mount does not honor 'user' option.
,
Diego Nicola Barbato
,
2019/10/01
bug#37569: Mount does not honor 'user' option.
,
Diego Nicola Barbato
,
2019/10/04
bug#37569: Mount does not honor 'user' option.
,
Ludovic Courtès
,
2019/10/06
bug#37505: "make check" fails on a fresh Guix checkout
,
Ludovic Courtès
,
2019/10/01
bug#37505: "make check" fails on a fresh Guix checkout
,
Konrad Hinsen
,
2019/10/01
bug#37505: "make check" fails on a fresh Guix checkout
,
Konrad Hinsen
,
2019/10/01
bug#37505: "make check" fails on a fresh Guix checkout
,
Konrad Hinsen
,
2019/10/01
bug#37505: "make check" fails on a fresh Guix checkout
,
Ludovic Courtès
,
2019/10/01
bug#37550: [core-updates] [PATCH] gnu: gcc: Fix i686-linux cross compiler.
,
Ludovic Courtès
,
2019/10/01
bug#37565: [use profile manifest] upstream VCS informations only available after a guix pull
,
Ludovic Courtès
,
2019/10/01
bug#37565: [use profile manifest] upstream VCS informations only available after a guix pull
,
YOANN P
,
2019/10/01
bug#37565: [use profile manifest] upstream VCS informations only available after a guix pull
,
Ludovic Courtès
,
2019/10/01
[
Prev Period
]
[
Next Period
]
Mail converted by
MHonArc