Archives are refreshed every 30 minutes - for details, please visit
the main index
.
You can also
download the archives in mbox format
.
bug-guix (thread)
[
Date Index
][
Top
][
All Lists
]
Advanced
[
Prev Period
]
Last Modified: Fri Nov 30 2018 06:57:10 -0500
Threads in reverse chronological order
[
Next Period
]
bug#33557: guix errors, if you want
,
znavko
,
2018/11/30
bug#33165: GNOME keyring SSH agent => sign_and_send_pubkey: signing failed: agent refused operation
,
Chris Marusich
,
2018/11/29
bug#33165: GNOME keyring SSH agent => sign_and_send_pubkey: signing failed: agent refused operation
,
Ricardo Wurmus
,
2018/11/29
bug#33555: test.iso-image-installer.i686 got stuck after kernel oops
,
Mark H Weaver
,
2018/11/29
bug#33542: Strange tarball download error on Hydra
,
Mark H Weaver
,
2018/11/28
bug#33542: Strange tarball download error on Hydra
,
Mark H Weaver
,
2018/11/28
bug#33542: Strange tarball download error on Hydra
,
Ludovic Courtès
,
2018/11/28
bug#33539: guix pull error: srfi/srfi-1.scm:592:17: In procedure map1:
,
znavko
,
2018/11/28
bug#33539: guix pull error: srfi/srfi-1.scm:592:17: In procedure map1:
,
Ludovic Courtès
,
2018/11/28
bug#33539: guix pull error: srfi/srfi-1.scm:592:17: In procedure map1:
,
znavko
,
2018/11/28
bug#33539: guix pull error: srfi/srfi-1.scm:592:17: In procedure map1:
,
Ludovic Courtès
,
2018/11/28
bug#33537: guix system error: In procedure swapon: "/dev/sda2": Invalid argument
,
znavko
,
2018/11/28
Message not available
bug#33537: Acknowledgement (guix system error: In procedure swapon: "/dev/sda2": Invalid argument)
,
znavko
,
2018/11/28
bug#33537: Acknowledgement (guix system error: In procedure swapon: "/dev/sda2": Invalid argument)
,
Julien Lepiller
,
2018/11/28
bug#33537: Acknowledgement (guix system error: In procedure swapon: "/dev/sda2": Invalid argument)
,
znavko
,
2018/11/28
bug#33537: Acknowledgement (guix system error: In procedure swapon: "/dev/sda2": Invalid argument)
,
Ludovic Courtès
,
2018/11/28
bug#33537: guix system error: In procedure swapon: "/dev/sda2": Invalid argument
,
znavko
,
2018/11/28
bug#33537: guix system error: In procedure swapon: "/dev/sda2": Invalid argument
,
Ludovic Courtès
,
2018/11/28
bug#33525: bigloo4.3b.tar.gz modified in place
,
Ludovic Courtès
,
2018/11/27
bug#33525: bigloo4.3b.tar.gz modified in place
,
Ludovic Courtès
,
2018/11/29
bug#33517: Problem booting when using btrfs subvolume for /gnu/store
,
Christopher Baines
,
2018/11/26
bug#33517: Problem booting when using btrfs subvolume for /gnu/store
,
Ludovic Courtès
,
2018/11/28
bug#33509: core-updates: arc-theme fails with "Invalid GNOME version: 3.24"
,
Björn Höfling
,
2018/11/26
bug#33509: core-updates: arc-theme fails with "Invalid GNOME version: 3.24"
,
Efraim Flashner
,
2018/11/26
bug#33509: core-updates: arc-theme fails with "Invalid GNOME version: 3.24"
,
Björn Höfling
,
2018/11/27
bug#33509: core-updates: arc-theme fails with "Invalid GNOME version: 3.24"
,
Efraim Flashner
,
2018/11/27
bug#33509: core-updates: arc-theme fails with "Invalid GNOME version: 3.24"
,
Ricardo Wurmus
,
2018/11/28
bug#33509: core-updates: arc-theme fails with "Invalid GNOME version: 3.24"
,
Björn Höfling
,
2018/11/27
bug#33509: core-updates: arc-theme fails with "Invalid GNOME version: 3.24"
,
Björn Höfling
,
2018/11/28
bug#33507: nss 3.39 output is not deterministic
,
Ludovic Courtès
,
2018/11/26
bug#33502: guix pull fails
,
Tobias Platen
,
2018/11/25
bug#33502: guix pull fails
,
Ludovic Courtès
,
2018/11/28
bug#33500: guix pull error. '34843fe'. guix-daemon-0.15.0-8.71a78ba.drv' failed with exit code 1
,
znavko
,
2018/11/25
bug#33500: guix pull error. '34843fe'. guix-daemon-0.15.0-8.71a78ba.drv' failed with exit code 1
,
Brett Gilio
,
2018/11/25
bug#33499: file-5.33 doesn't detect berkeley-db files correctly
,
Julien Lepiller
,
2018/11/25
bug#33497: Our CMake package has no documentation
,
Maxim Cournoyer
,
2018/11/25
bug#33497: [PATCH] Re: bug#33497: Our CMake package has no documentation
,
Maxim Cournoyer
,
2018/11/25
bug#33496: Guix pull failing to compute derivation
,
Brett Gilio
,
2018/11/24
bug#33496: Guix pull failing to compute derivation
,
Luther Thompson
,
2018/11/25
bug#33496: Guix pull failing to compute derivation
,
Ludovic Courtès
,
2018/11/25
bug#33500: bug#33496: Guix pull failing to compute derivation
,
Jan Nieuwenhuizen
,
2018/11/25
bug#33496: bug#33500: bug#33496: Guix pull failing to compute derivation
,
Ludovic Courtès
,
2018/11/26
bug#33489: Can't use binary installation with install script
,
Zephyr Waitzman
,
2018/11/24
bug#33489: Can't use binary installation with install script
,
Ludovic Courtès
,
2018/11/25
bug#33488: Does not compile libtorrent-rasterbar
,
znavko
,
2018/11/24
bug#32273: home-directory produces wrong /etc/passwd
,
Ludovic Courtès
,
2018/11/23
bug#33470: (Significantly) negative number of packages in profile
,
Tobias Geerinckx-Rice
,
2018/11/22
bug#33470: Confusing spinner artefacts
,
Tobias Geerinckx-Rice
,
2018/11/23
bug#33470: Confusing spinner artefacts
,
Gábor Boskovits
,
2018/11/23
bug#33470: Confusing spinner artefacts
,
Tobias Geerinckx-Rice
,
2018/11/23
bug#33190: Choose devices according to linux-libre code
,
Ludovic Courtès
,
2018/11/22
bug#33190: Choose devices according to linux-libre code
,
David Larsson
,
2018/11/22
bug#32966: tests/install.scm tests all fail
,
Clément Lassieur
,
2018/11/22
bug#33463: guix publish error on Hydra: fport_close: Bad file descriptor
,
Mark H Weaver
,
2018/11/21
bug#25634: 'guix environment mpv' fails to handle '/gnu/store/i1139n4ab0fn9v4bwkvqzp6sw3w66mqr-python-waf-1.9.5' file (not-a-dir)
,
Efraim Flashner
,
2018/11/21
bug#25634: 'guix environment mpv' fails to handle '/gnu/store/i1139n4ab0fn9v4bwkvqzp6sw3w66mqr-python-waf-1.9.5' file (not-a-dir)
,
Ludovic Courtès
,
2018/11/21
bug#33455: Zathura can't display PDF or epub
,
Bradley Haggerty
,
2018/11/21
bug#33455: Zathura can't display PDF or epub
,
Leo Famulari
,
2018/11/21
bug#33455: Zathura can't display PDF or epub
,
Ricardo Wurmus
,
2018/11/21
bug#32779: Cuirass: Crash and unable to restart when an input is unreachable
,
Ludovic Courtès
,
2018/11/20
bug#32779: Cuirass: Crash and unable to restart when an input is unreachable
,
Clément Lassieur
,
2018/11/20
bug#32583: Cuirass: some builds are marked as failed, but they were never built
,
Clément Lassieur
,
2018/11/20
bug#32583: Cuirass: some builds are marked as failed, but they were never built
,
Ludovic Courtès
,
2018/11/20
bug#33422: /etc/passwd on GuixSD can end up containing default home directories
,
Ludovic Courtès
,
2018/11/18
bug#33422: /etc/passwd on GuixSD can end up containing default home directories
,
Ludovic Courtès
,
2018/11/18
bug#33422: /etc/passwd on GuixSD can end up containing default home directories
,
Leo Famulari
,
2018/11/18
bug#33422: /etc/passwd on GuixSD can end up containing default home directories
,
Ludovic Courtès
,
2018/11/19
bug#33419: guix package is not showing that the checksum is mismatching
,
Björn Höfling
,
2018/11/18
bug#33419: guix package is not showing that the checksum is mismatching
,
Leo Famulari
,
2018/11/18
bug#33419: guix package is not showing that the checksum is mismatching
,
Björn Höfling
,
2018/11/19
bug#33419: guix package is not showing that the checksum is mismatching
,
Ludovic Courtès
,
2018/11/19
bug#33419: guix package is not showing that the checksum is mismatching
,
Björn Höfling
,
2018/11/21
bug#33419: guix package is not showing that the checksum is mismatching
,
Ludovic Courtès
,
2018/11/21
bug#33413: (Cuirass, berlin) raw logs are empty for guix-modular-master
,
swedebugia
,
2018/11/17
bug#33413: (Cuirass, berlin) raw logs are empty for guix-modular-master
,
Ludovic Courtès
,
2018/11/18
bug#33413: (Cuirass, berlin) raw logs are empty for guix-modular-master
,
swedebugia
,
2018/11/19
bug#33411: Guix fails to build master from source on 0.15 since a few days
,
swedebugia
,
2018/11/17
bug#33411: Guix fails to build master from source on 0.15 since a few days
,
swedebugia
,
2018/11/18
bug#33411: Guix fails to build master from source on 0.15 since a few days
,
Ludovic Courtès
,
2018/11/18
bug#33411: Guix fails to build master from source on 0.15 since a few days
,
swedebugia
,
2018/11/19
bug#33411: Guix fails to build master from source on 0.15 since a few days
,
Ludovic Courtès
,
2018/11/20
bug#30993: issue: ssh-daemon could not be started
,
Taegil Bae
,
2018/11/17
bug#30993: issue: ssh-daemon could not be started
,
Ludovic Courtès
,
2018/11/19
bug#30993: issue: ssh-daemon could not be started
,
Taegil Bae
,
2018/11/19
bug#33410: Offloaded builds can get stuck indefinitely due to network issues
,
Mark H Weaver
,
2018/11/16
bug#33410: Offloaded builds can get stuck indefinitely due to network issues
,
Ludovic Courtès
,
2018/11/17
bug#33409: guile-ssh build fail when run guix pull
,
Feng Shu
,
2018/11/16
bug#33407: Cuirass is dropping the SQLite error message when rethrowing
,
Björn Höfling
,
2018/11/16
bug#33407: Cuirass is dropping the SQLite error message when rethrowing
,
Ludovic Courtès
,
2018/11/16
bug#33407: Cuirass is dropping the SQLite error message when rethrowing
,
Björn Höfling
,
2018/11/16
bug#31891: [PATCH] Re: bug#33196: emacs-realgud build failure
,
Maxim Cournoyer
,
2018/11/15
bug#33404: failure behavior for "guix package --upgrade"
,
Reed Campbell Meyerson
,
2018/11/15
bug#33404: failure behavior for "guix package --upgrade"
,
Ludovic Courtès
,
2018/11/16
bug#33404: failure behavior for "guix package --upgrade"
,
Reed Campbell Meyerson
,
2018/11/19
bug#33397: "guix environment" does not warn about stopped jobs
,
swedebugia
,
2018/11/15
bug#32458: Acknowledgement (SDL SEGFAULTs on foreign distro)
,
Marius Bakke
,
2018/11/14
bug#33381: --substitute-urls doesn't allow for more than one URL
,
Clément Lassieur
,
2018/11/14
bug#33381: --substitute-urls doesn't allow for more than one URL
,
Ludovic Courtès
,
2018/11/14
bug#33381: --substitute-urls doesn't allow for more than one URL
,
Clément Lassieur
,
2018/11/14
bug#33379: Cuirass doesn't try to build 'wine' for x86_64
,
Clément Lassieur
,
2018/11/14
bug#33379: Cuirass doesn't try to build 'wine' for x86_64
,
Ludovic Courtès
,
2018/11/14
bug#33379: Cuirass doesn't try to build 'wine' for x86_64
,
Clément Lassieur
,
2018/11/14
bug#33378: offload: Avoid hosts with little or no free disk space
,
Ludovic Courtès
,
2018/11/14
bug#33373: Guix 0.15 reports wrong age "Your Guix installation is 9 days old"
,
swedebugia
,
2018/11/14
bug#33373: Guix 0.15 reports wrong age "Your Guix installation is 9 days old"
,
Ludovic Courtès
,
2018/11/14
bug#33373: Guix 0.15 reports wrong age "Your Guix installation is 9 days old"
,
swedebugia
,
2018/11/15
bug#33373: Guix 0.15 reports wrong age "Your Guix installation is 9 days old"
,
Ludovic Courtès
,
2018/11/15
bug#33370: guix publish: at least one user will have to build a given substitute
,
Clément Lassieur
,
2018/11/13
bug#33370: guix publish: at least one user will have to build a given substitute
,
Ludovic Courtès
,
2018/11/14
bug#33370: guix publish: at least one user will have to build a given substitute
,
Clément Lassieur
,
2018/11/14
bug#33370: guix publish: at least one user will have to build a given substitute
,
Ludovic Courtès
,
2018/11/14
bug#33370: Cuirass: Trigger 'guix publish' baking
,
Clément Lassieur
,
2018/11/14
bug#33368: "guix archive" fails because of guix-authenticate
,
Konrad Hinsen
,
2018/11/13
bug#33368: "guix archive" fails because of guix-authenticate
,
Ludovic Courtès
,
2018/11/14
bug#33368: "guix archive" fails because of guix-authenticate
,
Konrad Hinsen
,
2018/11/14
bug#33368: "guix archive" fails because of guix-authenticate
,
Ludovic Courtès
,
2018/11/14
bug#33368: "guix archive" fails because of guix-authenticate
,
Konrad Hinsen
,
2018/11/15
bug#33368: "guix archive" fails because of guix-authenticate
,
Ludovic Courtès
,
2018/11/15
bug#33368: "guix archive" fails because of guix-authenticate
,
Ludovic Courtès
,
2018/11/14
bug#33368: "guix archive" fails because of guix-authenticate
,
Ricardo Wurmus
,
2018/11/14
bug#33365: Package 'direnv' fails to build
,
Konrad Hinsen
,
2018/11/13
bug#33365: Package 'direnv' fails to build
,
Leo Famulari
,
2018/11/13
bug#33365: Package 'direnv' fails to build
,
Konrad Hinsen
,
2018/11/13
bug#33362: System tests stuck in "shepherd[1]: waiting for udevd..."
,
Mark H Weaver
,
2018/11/12
bug#33362: System tests stuck in "shepherd[1]: waiting for udevd..."
,
Mark H Weaver
,
2018/11/13
bug#33362: System tests stuck in "shepherd[1]: waiting for udevd..."
,
Mark H Weaver
,
2018/11/29
bug#33362: System tests stuck in "shepherd[1]: waiting for udevd..."
,
Danny Milosavljevic
,
2018/11/29
bug#33362: System tests stuck in "shepherd[1]: waiting for udevd..."
,
Ludovic Courtès
,
2018/11/20
bug#33361: Directories in the store get non-zero timestamps
,
Ludovic Courtès
,
2018/11/12
bug#33361: Directories in the store get non-zero timestamps
,
Ludovic Courtès
,
2018/11/13
bug#33360: Guix does not error pretty when filesystem is ro
,
swedebugia
,
2018/11/12
bug#33360: Guix does not error pretty when filesystem is ro
,
Ludovic Courtès
,
2018/11/14
bug#33360: Guix does not error pretty when filesystem is ro
,
swedebugia
,
2018/11/18
bug#33359: On emacs-clang-format
,
Tim Gesthuizen
,
2018/11/12
bug#33359: On emacs-clang-format
,
Ludovic Courtès
,
2018/11/14
bug#33359: On emacs-clang-format
,
Pierre Neidhardt
,
2018/11/14
bug#33359: On emacs-clang-format
,
Tim Gesthuizen
,
2018/11/14
bug#33359: On emacs-clang-format
,
Pierre Neidhardt
,
2018/11/26
bug#33030: Crash in progress-bar
,
Ricardo Wurmus
,
2018/11/11
bug#33030: Crash in progress-bar
,
Ludovic Courtès
,
2018/11/16
bug#33030: Crash in progress-bar
,
Clément Lassieur
,
2018/11/19
bug#33346: spice-vdagent.desktop exec failure
,
Taegil Bae
,
2018/11/11
bug#33346: spice-vdagent.desktop exec failure
,
Leo Famulari
,
2018/11/13
bug#33343: Error bind mounting `/dev/full' to /gnu/store/... on reconfigure.
,
Brendan Tildesley
,
2018/11/11
bug#33343: Error bind mounting `/dev/full' to /gnu/store/... on reconfigure.
,
Ludovic Courtès
,
2018/11/11
bug#28159: Updater needs to support HTTP(S) servers
,
Ludovic Courtès
,
2018/11/10
bug#32631: the Dovecot service stops working
,
Clément Lassieur
,
2018/11/10
bug#33330: Hurd failing to build
,
Brett Gilio
,
2018/11/09
bug#33330: Hurd failing to build
,
Manolis Ragkousis
,
2018/11/10
bug#33330: Hurd failing to build
,
Joshua Branson
,
2018/11/10
bug#33330: Hurd failing to build
,
Brett Gilio
,
2018/11/10
bug#33330: Hurd failing to build
,
Ludovic Courtès
,
2018/11/11
bug#33330: Hurd failing to build
,
Manolis Ragkousis
,
2018/11/11
bug#33330: Hurd failing to build
,
Brett Gilio
,
2018/11/11
bug#33330: Hurd failing to build
,
Ludovic Courtès
,
2018/11/18
bug#33326: gnupg: error: .config/guix/upstream/trustedkeys.kbx': No such file or directory
,
swedebugia
,
2018/11/09
bug#33326: gnupg: error: .config/guix/upstream/trustedkeys.kbx': No such file or directory
,
Ludovic Courtès
,
2018/11/11
bug#33325: xpra doesn't work out-of-the-box (implicit dependencies)
,
Ludovic Courtès
,
2018/11/09
bug#33325: xpra doesn't work out-of-the-box (implicit dependencies)
,
Rutger Helling
,
2018/11/09
bug#33325: xpra doesn't work out-of-the-box (implicit dependencies)
,
Ludovic Courtès
,
2018/11/12
bug#33325: xpra doesn't work out-of-the-box (implicit dependencies)
,
Ludovic Courtès
,
2018/11/25
bug#33325: xpra doesn't work out-of-the-box (implicit dependencies)
,
Rutger Helling
,
2018/11/26
bug#33325: xpra doesn't work out-of-the-box (implicit dependencies)
,
Ludovic Courtès
,
2018/11/26
bug#33325: xpra doesn't work out-of-the-box (implicit dependencies)
,
Rutger Helling
,
2018/11/26
bug#33323: guix package (--show & --search) missing error when package is not found
,
swedebugia
,
2018/11/08
bug#33323: guix package (--show & --search) missing error when package is not found
,
Ludovic Courtès
,
2018/11/11
bug#33312: Guix: many tests fail when building on 0.15
,
swedebugia
,
2018/11/08
bug#33312: Guix: many tests fail when building on 0.15
,
swedebugia
,
2018/11/08
bug#33312: Guix: many tests fail when building on 0.15
,
Ludovic Courtès
,
2018/11/11
bug#33312: Guix: many tests fail when building on 0.15
,
swedebugia
,
2018/11/11
bug#33312: Guix: many tests fail when building on 0.15
,
Ludovic Courtès
,
2018/11/12
bug#33312: Guix: many tests fail when building on 0.15
,
Ludovic Courtès
,
2018/11/14
bug#33310: Cuirass: Evaluations adding no new builds are displayed as "failing"
,
Clément Lassieur
,
2018/11/08
bug#33310: Cuirass: Evaluations adding no new builds are displayed as "failing"
,
Ludovic Courtès
,
2018/11/11
bug#33078: Attempt to build my GuixSD system now fails
,
Ludovic Courtès
,
2018/11/07
bug#33306: guix pull error: Wrong type to apply: #t
,
znavko
,
2018/11/07
bug#33306: guix pull error: Wrong type to apply: #t
,
Ludovic Courtès
,
2018/11/07
bug#32734: Cuirass: Evaluations errors appear are "In progress..."
,
Ludovic Courtès
,
2018/11/07
bug#32734: Cuirass: Evaluations errors appear are "In progress..."
,
Clément Lassieur
,
2018/11/07
bug#33124: Cuirass: register GC roots for evaluations under /var/guix/gcroots
,
Ludovic Courtès
,
2018/11/07
bug#33124: Cuirass: register GC roots for evaluations under /var/guix/gcroots
,
Clément Lassieur
,
2018/11/07
bug#33300: hplip 3.18.9 contains non-free binary blobs
,
Ludovic Courtès
,
2018/11/07
bug#33300: hplip 3.18.9 contains non-free binary blobs
,
Efraim Flashner
,
2018/11/07
bug#33300: hplip 3.18.9 contains non-free binary blobs
,
Ludovic Courtès
,
2018/11/07
bug#33300: hplip 3.18.9 contains non-free binary blobs
,
Tobias Geerinckx-Rice
,
2018/11/07
bug#33300: hplip 3.18.9 contains non-free binary blobs
,
Ludovic Courtès
,
2018/11/07
bug#33300: Automatically detecting binaries in source tarballs
,
Danny Milosavljevic
,
2018/11/07
bug#33300: Automatically detecting binaries in source tarballs
,
Ludovic Courtès
,
2018/11/08
bug#33300: Automatically detecting binaries in source tarballs
,
Björn Höfling
,
2018/11/08
bug#33300: Automatically detecting binaries in source tarballs
,
Efraim Flashner
,
2018/11/11
bug#33300: Automatically detecting binaries in source tarballs
,
Ludovic Courtès
,
2018/11/11
bug#33300: hplip 3.18.9 contains non-free binary blobs
,
Ludovic Courtès
,
2018/11/11
bug#33299: shepherd: Service ssh-daemon could not be started.
,
swedebugia
,
2018/11/07
bug#30993: bug#33299: shepherd: Service ssh-daemon could not be started.
,
Ludovic Courtès
,
2018/11/07
bug#33297: Unable to build system, due to failure in raw-initrd
,
Mark H Weaver
,
2018/11/07
bug#33297: Unable to build system, due to failure in raw-initrd
,
Mark H Weaver
,
2018/11/07
bug#33297: Unable to build system, due to failure in raw-initrd
,
Ludovic Courtès
,
2018/11/07
bug#33293: Documentation links in guix.info site are broken
,
Laura Lazzati
,
2018/11/06
bug#33285: Installing, then removing, a package yields a different profile
,
Chris Marusich
,
2018/11/06
bug#33285: Installing, then removing, a package yields a different profile
,
Ludovic Courtès
,
2018/11/06
bug#33285: Installing, then removing, a package yields a different profile
,
Chris Marusich
,
2018/11/07
bug#33280: Guix weather does not error nicely with 502 errors from hydra
,
swedebugia
,
2018/11/05
bug#33280: Guix weather does not error nicely with 502 errors from hydra
,
Mark H Weaver
,
2018/11/05
bug#33280: Guix weather does not error nicely with 502 errors from hydra
,
Ludovic Courtès
,
2018/11/06
bug#33280: Guix weather does not error nicely with 502 errors from hydra
,
swedebugia
,
2018/11/06
bug#33280: Guix weather does not error nicely with 502 errors from hydra
,
Ludovic Courtès
,
2018/11/07
bug#33279: guile-readline: error: no code for module
,
swedebugia
,
2018/11/05
bug#33279: guile-readline: error: no code for module
,
Ludovic Courtès
,
2018/11/06
bug#33279: guile-readline: error: no code for module
,
swedebugia
,
2018/11/06
bug#33279: guile-readline: error: no code for module
,
Marius Bakke
,
2018/11/06
bug#33279: GUILE_LOAD_PATH and GUILE_LOAD_COMPILED_PATH on GuixSD
,
Ludovic Courtès
,
2018/11/07
bug#33279: GUILE_LOAD_PATH and GUILE_LOAD_COMPILED_PATH on GuixSD
,
swedebugia
,
2018/11/07
bug#33278: failed build of webkit
,
David Larsson
,
2018/11/05
bug#33278: failed build of webkit
,
Leo Famulari
,
2018/11/05
bug#33278: failed build of webkit
,
david . larsson
,
2018/11/05
bug#33278: failed build of webkit
,
Leo Famulari
,
2018/11/05
bug#33278: failed build of webkit
,
David Larsson
,
2018/11/05
bug#33276: guix still building when substitute is available (or is guix pull not reproducible)
,
Pjotr Prins
,
2018/11/05
bug#33276: guix still building when substitute is available (or is guix pull not reproducible)
,
Ludovic Courtès
,
2018/11/06
bug#33276: guix still building when substitute is available (or is guix pull not reproducible)
,
Pjotr Prins
,
2018/11/08
bug#33274: [wishlist] Removing old system generation via guix system remove-generation
,
swedebugia
,
2018/11/05
bug#33274: [wishlist] Removing old system generation via guix system remove-generation
,
Leo Famulari
,
2018/11/05
bug#33273: guix system does not emit command-list when run with no arguments
,
swedebugia
,
2018/11/05
bug#33273: guix system does not emit command-list when run with no arguments
,
Ludovic Courtès
,
2018/11/06
bug#33272: guix refresh/download backtrace error when missing nss-certs
,
swedebugia
,
2018/11/05
bug#33272: guix refresh/download backtrace error when missing nss-certs
,
Leo Famulari
,
2018/11/05
bug#33272: guix refresh/download backtrace error when missing nss-certs
,
swedebugia
,
2018/11/05
bug#33272: guix refresh/download backtrace error when missing nss-certs
,
Leo Famulari
,
2018/11/05
bug#33272: guix refresh/download backtrace error when missing nss-certs
,
swedebugia
,
2018/11/06
bug#33272: guix refresh/download backtrace error when missing nss-certs
,
Leo Famulari
,
2018/11/06
bug#33151: 'guix substitute' returns a 504 error without trying to use other servers
,
Clément Lassieur
,
2018/11/05
bug#33151: 'guix substitute' returns a 504 error without trying to use other servers
,
Ludovic Courtès
,
2018/11/05
bug#33151: 'guix substitute' returns a 504 error without trying to use other servers
,
Clément Lassieur
,
2018/11/10
bug#33271: [SHEPHERD Feature request] Let "# herd" print status by default
,
swedebugia
,
2018/11/05
bug#33270: [SHEPHERD] Wrong error message when missing priviledge
,
swedebugia
,
2018/11/05
bug#33270: [SHEPHERD] Wrong error message when missing priviledge
,
Ricardo Wurmus
,
2018/11/05
bug#33270: [SHEPHERD] Wrong error message when missing priviledge
,
Gábor Boskovits
,
2018/11/05
bug#33270: [SHEPHERD] Wrong error message when missing priviledge
,
Danny Milosavljevic
,
2018/11/05
bug#33270: [SHEPHERD] Wrong error message when missing priviledge
,
Gábor Boskovits
,
2018/11/06
bug#33266: guix-copy: Honor the SSH port of a host when defined in ~/.ssh/config
,
Maxim Cournoyer
,
2018/11/04
bug#33266: guix-copy: Honor the SSH port of a host when defined in ~/.ssh/config
,
Ludovic Courtès
,
2018/11/06
bug#33266: guix-copy: Honor the SSH port of a host when defined in ~/.ssh/config
,
Maxim Cournoyer
,
2018/11/08
bug#33262: guix fails to find and use some available substitutes
,
George Clemmer
,
2018/11/04
bug#33262: guix fails to find and use some available substitutes
,
George Clemmer
,
2018/11/04
bug#33262: guix fails to find and use some available substitutes
,
Julien Lepiller
,
2018/11/05
bug#33262: guix fails to find and use some available substitutes
,
George Clemmer
,
2018/11/05
bug#33262: guix fails to find and use some available substitutes
,
Julien Lepiller
,
2018/11/05
bug#33261: [substitute-urls] Fails when given only "berlin.guixsd.org"
,
swedebugia
,
2018/11/04
bug#33261: [substitute-urls] Fails when given only "berlin.guixsd.org"
,
Björn Höfling
,
2018/11/05
bug#33261: [substitute-urls] Fails when given only "berlin.guixsd.org"
,
Leo Famulari
,
2018/11/05
bug#33261: [substitute-urls] Fails when given only "berlin.guixsd.org"
,
swedebugia
,
2018/11/05
bug#33261: [substitute-urls] Fails when given only "berlin.guixsd.org"
,
Leo Famulari
,
2018/11/05
bug#33261: [substitute-urls] Fails when given only "berlin.guixsd.org"
,
Ludovic Courtès
,
2018/11/06
bug#33260: [Shepherd] ERROR: In procedure stat: No such file or directory: "/run/user/30011/shepherd
,
swedebugia
,
2018/11/04
bug#33260: Invocation of per-user shepherd - design needed
,
Danny Milosavljevic
,
2018/11/04
bug#33260: Invocation of per-user shepherd - design needed
,
swedebugia
,
2018/11/05
bug#33260: Invocation of per-user shepherd - design needed
,
Danny Milosavljevic
,
2018/11/05
bug#33260: Invocation of per-user shepherd - design needed
,
Gábor Boskovits
,
2018/11/05
bug#33260: [Shepherd] ERROR: In procedure stat: No such file or directory: "/run/user/30011/shepherd
,
Ludovic Courtès
,
2018/11/06
bug#33260: [Shepherd] ERROR: In procedure stat: No such file or directory: "/run/user/30011/shepherd
,
swedebugia
,
2018/11/06
bug#33260: [Shepherd] ERROR: In procedure stat: No such file or directory: "/run/user/30011/shepherd
,
Ludovic Courtès
,
2018/11/07
bug#33260: [Shepherd] ERROR: In procedure stat: No such file or directory: "/run/user/30011/shepherd
,
swedebugia
,
2018/11/07
bug#33260: [Shepherd] ERROR: In procedure stat: No such file or directory: "/run/user/30011/shepherd
,
Marius Bakke
,
2018/11/07
bug#33260: [Shepherd] ERROR: In procedure stat: No such file or directory: "/run/user/30011/shepherd
,
Ludovic Courtès
,
2018/11/08
bug#33260: [Shepherd] ERROR: In procedure stat: No such file or directory: "/run/user/30011/shepherd
,
Marius Bakke
,
2018/11/14
bug#33260: [Shepherd] ERROR: In procedure stat: No such file or directory: "/run/user/30011/shepherd
,
Ludovic Courtès
,
2018/11/14
bug#33260: [Shepherd] ERROR: In procedure stat: No such file or directory: "/run/user/30011/shepherd
,
Marius Bakke
,
2018/11/14
bug#33260: [Shepherd] ERROR: In procedure stat: No such file or directory: "/run/user/30011/shepherd
,
Danny Milosavljevic
,
2018/11/16
bug#33260: [Shepherd] ERROR: In procedure stat: No such file or directory: "/run/user/30011/shepherd
,
Ludovic Courtès
,
2018/11/16
bug#33253: nss cannot build
,
Gnu Röoty
,
2018/11/04
bug#33253: nss cannot build
,
Quiliro Ordonez
,
2018/11/04
bug#33253: nss cannot build
,
Björn Höfling
,
2018/11/04
bug#33193: vim tests break terminal output
,
Ludovic Courtès
,
2018/11/03
bug#33193: vim tests break terminal output
,
Efraim Flashner
,
2018/11/12
bug#33177: Sound Services manual typo
,
Ludovic Courtès
,
2018/11/03
bug#33248: python-minimal compilation is breaking
,
znavko
,
2018/11/03
bug#33248: python-minimal compilation is breaking
,
Gábor Boskovits
,
2018/11/03
bug#33248: python-minimal compilation is breaking
,
znavko
,
2018/11/03
bug#33248: python-minimal compilation is breaking
,
Julien Lepiller
,
2018/11/03
bug#33248: python-minimal compilation is breaking
,
Christopher Baines
,
2018/11/03
bug#33248: python-minimal compilation is breaking
,
znavko
,
2018/11/03
bug#33248: python-minimal compilation is breaking
,
Ludovic Courtès
,
2018/11/03
bug#33248: python-minimal compilation is breaking
,
George Clemmer
,
2018/11/03
bug#33246: Updating ldc to 1.11.0/1.12.0 (WIP)
,
Pjotr Prins
,
2018/11/02
bug#32183: New ‘guix pull’ /root/.config/current/bin/guix: Permission denied
,
swedebugia
,
2018/11/02
bug#32183: New ‘guix pull’ /root/.config/current/bin/guix: Permission denied
,
Ludovic Courtès
,
2018/11/03
bug#33240: bzip2
,
Gnu Röoty
,
2018/11/02
bug#33240: bzip2
,
swedebugia
,
2018/11/02
bug#33239: 'guix offload' regularly hangs in 'channel-get-exit-status' call
,
Ludovic Courtès
,
2018/11/02
bug#33239: 'guix offload' regularly hangs in 'channel-get-exit-status' call
,
swedebugia
,
2018/11/02
bug#33239: 'guix offload' regularly hangs in 'channel-get-exit-status' call
,
Ludovic Courtès
,
2018/11/03
bug#33239: 'guix offload' regularly hangs in 'channel-get-exit-status' call
,
swedebugia
,
2018/11/17
bug#33239: 'guix offload' regularly hangs in 'channel-get-exit-status' call
,
Ludovic Courtès
,
2018/11/23
bug#33239: 'guix offload' regularly hangs in 'channel-get-exit-status' call
,
Ludovic Courtès
,
2018/11/25
bug#33238: Fail nicely when profile is not found
,
swedebugia
,
2018/11/02
bug#31095: [aegisub] error: Aegisub requires that boost be built with ICU support.
,
Leo Famulari
,
2018/11/02
bug#31095: [aegisub] error: Aegisub requires that boost be built with ICU support.
,
Björn Höfling
,
2018/11/25
bug#31095: [aegisub] error: Aegisub requires that boost be built with ICU support.
,
Björn Höfling
,
2018/11/25
bug#31377: mpd state file
,
Leo Famulari
,
2018/11/01
Message not available
bug#31377: mpd state file
,
Leo Famulari
,
2018/11/02
bug#32949: Go 1.11 keeps references to bootstrap Go, many other packages
,
Leo Famulari
,
2018/11/01
bug#33236: Duplicate packagego-github-com-urfave-cli
,
Leo Famulari
,
2018/11/01
bug#33236: Duplicate packagego-github-com-urfave-cli
,
Pierre Neidhardt
,
2018/11/02
bug#33236: Duplicate packagego-github-com-urfave-cli
,
Pierre Neidhardt
,
2018/11/04
bug#33235: Bzip hash error
,
brettg
,
2018/11/01
bug#33235: Bzip hash error
,
Leo Famulari
,
2018/11/01
Message not available
bug#33235: Bzip hash error
,
Leo Famulari
,
2018/11/01
bug#33235: Bzip hash error
,
brettg
,
2018/11/01
bug#33235: Bzip hash error
,
Leo Famulari
,
2018/11/02
bug#33235: Bzip hash error
,
Björn Höfling
,
2018/11/02
bug#33235: Bzip hash error
,
brettg
,
2018/11/02
Message not available
bug#33235: Bzip hash error
,
Björn Höfling
,
2018/11/02
bug#33235: Bzip hash error
,
swedebugia
,
2018/11/02
bug#33235: Bzip hash error
,
swedebugia
,
2018/11/05
bug#33234: Guix (weather): there can be only one
,
Tobias Geerinckx-Rice
,
2018/11/01
bug#33082: guix pull resulted in an error: compute-guix-derivation
,
Ludovic Courtès
,
2018/11/01
bug#33171: TMPDIR and build containers
,
Ludovic Courtès
,
2018/11/01
bug#33223: In vm-image >>> 'guix package -i' >>> "-python-3.6.5.drv... -Killed"
,
Gábor Boskovits
,
2018/11/01
bug#33223: In vm-image >>> 'guix package -i' >>> "-python-3.6.5.drv... -Killed"
,
George Clemmer
,
2018/11/01
bug#33223: In vm-image >>> 'guix package -i' >>> "-python-3.6.5.drv... -Killed"
,
Gábor Boskovits
,
2018/11/01
bug#33223: In vm-image >>> 'guix package -i' >>> "-python-3.6.5.drv... -Killed"
,
George Clemmer
,
2018/11/03
[
Prev Period
]
[
Next Period
]
Mail converted by
MHonArc