[Date Prev][Date Next][Thread Prev][Thread Next][Date Index][Thread Index]
bug#31693: Guix :: KeepassXC :: Fatal Compilation Failure
From: |
Efraim Flashner |
Subject: |
bug#31693: Guix :: KeepassXC :: Fatal Compilation Failure |
Date: |
Sun, 3 Jun 2018 12:47:11 +0300 |
User-agent: |
Mutt/1.10.0 (2018-05-17) |
On Sun, Jun 03, 2018 at 04:21:08AM +0000, Alex Dorof wrote:
> Encountered a problem while running `guix package -u` on guix commit
> 15dcd292df417ef26b69ab892b68c21812c596a7 on a GuixSD system.
>
> Package keepassxc fails to build with the following message. Can provide any
> other logs as needed.
>
> make[2]: *** [src/CMakeFiles/keepassx_core.dir/build.make:2322:
> src/CMakeFiles/keepassx_core.dir/gui/entry/EditEntryWidget.cpp.o] Error 1
> make[2]: *** Waiting for unfinished jobs....
> make[2]: Leaving directory '/tmp/guix-build-keepassxc-2.3.3.drv-0/build'
> make[1]: *** [CMakeFiles/Makefile2:237: src/CMakeFiles/keepassx_core.dir/all]
> Error 2
> make[1]: Leaving directory '/tmp/guix-build-keepassxc-2.3.3.drv-0/build'
> make: *** [Makefile:142: all] Error 2
> phase `build' failed after 131.9 seconds
> builder for `/gnu/store/3bppc463xssii6i4s0q8063xgcbzgkw1-keepassxc-2.3.3.drv'
> failed with exit code
> 1
> guix package: error: build failed: build of
> `/gnu/store/3bppc463xssii6i4s0q8063xgcbzgkw1-keepassxc-2.3.3.drv' failed
>
Fixed in 6f5c67d7250913bde52f47904fda08325a9334a3
--
Efraim Flashner <address@hidden> אפרים פלשנר
GPG key = A28B F40C 3E55 1372 662D 14F7 41AA E7DC CA3D 8351
Confidentiality cannot be guaranteed on emails sent or received unencrypted
signature.asc
Description: PGP signature